{"text_format":"1","workbook":"xlsx","n_sheets":4,"sheets":["P. BDI","Orçamento","QCI","CRON"],"not_rendered":{"charts":0,"images":0,"macros":1,"external_links":1,"defined_names":26,"comments":2,"pivot_tables":0},"unopened":[],"bounds":{"document_bytes":16777216,"sheet_cells":100000,"rows_first":2000,"rows_last":500,"rows_between":2000,"halvings":0,"cell_chars":16384,"cell_head_chars":4096},"cells_cut":0,"cells_raw":0,"read":"whole","date_system":"1900"}

{"sheet":"P. BDI","index":0,"n_rows":46,"n_cols":10,"rows_kept":46,"cut":false,"hidden":false,"merged":[[1,1,1,5],[2,2,2,5],[3,2,3,5],[4,2,4,5],[5,2,5,5],[11,3,11,5],[6,2,6,5],[7,2,7,5],[30,1,30,4],[32,1,32,5],[8,2,8,5],[34,1,34,5],[35,1,35,5],[14,3,14,5],[18,2,18,4],[25,1,25,4],[26,1,26,4],[27,1,27,4],[29,1,29,4]]}
[null,"IMPRIMIR EM PAPEL TIMBRADO DA EMPRESA PROPONENTE "]
[null,"BDI - Bonificações e Despesas Indiretas"]
[null,"Edital :","TP - 17/2018"]
[null,"Tomador: ","Prefeitura Municipal de Dois Vizinhos - PR"]
[null,"Empreendimento: ","Construção Piso Quadra  Escola Mun. 28 de Novembro"]
[null,"Local da Obra:","Rua Padre Anchieta, 520, Dois Vizinhos PR"]
[null,"Empresa Prop.:","xxxxxxxxxxxxx"]
[null,"CNPJ:","xxxxxxxxxxxxx"]
[null,"Data base:","xxxxxxxxxxxxx"]
[]
[null,"Identifique o tipo de obra:",1,{"$f":"IF(C11>0,IF(C11<7,,\"<--- Insira valor entre 1 e 6\"),\"<--- Insira valor entre 1 e 6\")","v":0}]
[null,"Construção de edifícios:",1,"Informe a base de cálculo do ISSQN."]
[null,"Construção de rodovias e ferrovias:",2,{"$f":"IF(D14<>0,0,\"( X )\")","v":0},"Sobre os serviços."]
[null,"Construção de redes de abastecimento de água, coleta de esgoto e construções correlatas:",3,"x","Sobre a mão-de-obra."]
[null,"Construção e manutenção de estações e redes de distribuição de energia elétrica:",4,"Informe a ocorrência da DESONERAÇÃO da folha de pagamento. Lei 12844/2013."]
[null,"Obras portuárias, marítimas e fluviais:",5,{"$f":"IF(D17<>0,0,\"( X )\")","v":0},"SEM Desoneração."]
[null,"Fornecimento de materiais e equipamentos:",6,"x","COM Desoneração."]
[]
[null,null,"Intervalo de admissibilidade",null,null,null,null,"Ac",{"$f":"F21","v":"preencher"}]
[null,"Item Componente do BDI","1º Quartil","Médio","3º Quartil","Valores Propostos",null,"S",{"$f":"F22","v":"preencher"}]
[null,"Administração Central",0.03,0.04,5.5E-2,"preencher",{"$f":"IF(F21=0,\"\",IF(F21<C21,\"Atenção, observar os intervalos!\",IF(F21>E21,\"Atenção, observar os intervalos!\",\"\")))","v":"Atenção, observar os intervalos!"},"G",{"$f":"I20","v":"preencher"}]
[null,"Seguro e Garantia",8.0000000000000002E-3,8.0000000000000002E-3,0.01,"preencher",{"$f":"IF(F22=0,\"\",IF(F22<C22,\"Atenção, observar os intervalos!\",IF(F22>E22,\"Atenção, observar os intervalos!\",\"\")))","v":"Atenção, observar os intervalos!"},"R",{"$f":"F23","v":"preencher"}]
[null,"Risco",9.7000000000000003E-3,1.2699999999999999E-2,1.2699999999999999E-2,"preencher",{"$f":"IF(F23=0,\"\",IF(F23<C23,\"Atenção, observar os intervalos!\",IF(F23>E23,\"Atenção, observar os intervalos!\",\"\")))","v":"Atenção, observar os intervalos!"},"DF","preencher"]
[null,"Despesas Financeiras",5.8999999999999999E-3,1.23E-2,1.3899999999999999E-2,"preencher",{"$f":"IF(F24=0,\"\",IF(F24<C24,\"Atenção, observar os intervalos!\",IF(F24>E24,\"Atenção, observar os intervalos!\",\"\")))","v":"Atenção, observar os intervalos!"},"L","preencher"]
[null,"Lucro",6.1600000000000002E-2,7.3999999999999996E-2,8.9599999999999999E-2,"preencher",{"$f":"IF(F25=0,\"\",IF(F25<C25,\"Atenção, observar os intervalos!\",IF(F25>E25,\"Atenção, observar os intervalos!\",\"\")))","v":"Atenção, observar os intervalos!"},"l1","preencher"]
[null,"I1: PIS e COFINS",null,null,null,"preencher",null,"l2","preencher"]
[null,"I2: ISSQN (conforme legislação municipal)",null,null,null,"preencher",null,"l3",4.4999999999999998E-2]
[null,"I3: Cont.Prev s/Rec.Bruta (Lei 12844/13 - Desoneração)",null,null,null,4.4999999999999998E-2]
[]
[null,"BDI - SEM Desoneração da folha de pagamento",null,null,null,{"$f":"ROUND((((1+I19+I21+I22)*(1+I23)*(1+I24))/(1-I25-I26))-1,4)","v":{"$error":"#VALUE!"}},null,"1º QUARTIL","MÉDIO","3º QUARTIL"]
[null,"BDI - COM Desoneração da folha de pagamento",null,null,null,{"$f":"ROUND((((1+I19+I21+I22)*(1+I23)*(1+I24))/(1-I25-I26-I27))-1,4)","v":{"$error":"#VALUE!"}},null,0.2034,0.22120000000000001,0.25]
[]
[null,"Declaramos que esta planilha foi elaborada conforme equação para cálculo do percentual do BDI recomendada pelo Acórdão 2622/2013 - TCU, representada pela fórmula abaixo."]
[]
[null,"BDI - SEM Desoneração = [(1+AC+S+G+R)X(1+DF)X(1+L)/(1-I1-I2)]-1"]
[null,"BDI - COM Desoneração = [(1+AC+S+G+R)X(1+DF)X(1+L)/(1-I1-I2-I3)]-1"]
[]
[]
[null,"Responsável Técnico:","."]
[null,"Carimbo e Assinatura CREA/CAU:","."]
[]
[]
[]
[]
[null,"Responsavel Legal:","."]
[null,"Carimbo e Assinatura","cpf:"]

{"sheet":"Orçamento","index":1,"n_rows":48,"n_cols":8,"rows_kept":48,"cut":false,"hidden":false,"merged":[[1,0,2,7],[4,0,4,1],[5,0,5,1],[6,0,6,1],[7,0,7,1],[4,3,4,4],[5,3,5,4],[4,5,4,6],[5,5,5,6],[27,0,27,6],[8,4,8,7],[28,0,28,6],[9,0,9,1],[10,0,10,1],[8,0,8,1],[26,0,26,6],[11,0,11,1]]}
["IMPRIMIR EM PAPEL TIMBRADO DA EMPRESA PROPONENTE "]
["PLANILHA ORÇAMENTARIA"]
[]
[]
[{"$f":"'P. BDI'!B3","v":"Edital :"},null,{"$f":"'P. BDI'!C3:F3","v":"TP - 17/2018"},"Área:",null,{"$f":"F25","v":423.1},null,"m²"]
[{"$f":"'P. BDI'!B4","v":"Tomador: "},null,{"$f":"'P. BDI'!C4:F4","v":"Prefeitura Municipal de Dois Vizinhos - PR"},"Custo R$/m2",null,{"$f":"H29/F5","v":{"$error":"#VALUE!"}}]
[{"$f":"'P. BDI'!B5","v":"Empreendimento: "},null,{"$f":"'P. BDI'!C5:F5","v":"Construção Piso Quadra  Escola Mun. 28 de Novembro"}]
[{"$f":"'P. BDI'!B6","v":"Local da Obra:"},null,{"$f":"'P. BDI'!C6:F6","v":"Rua Padre Anchieta, 520, Dois Vizinhos PR"}]
[{"$f":"'P. BDI'!B7","v":"Empresa Prop.:"},null,{"$f":"'P. BDI'!C7:F7","v":"xxxxxxxxxxxxx"}]
[{"$f":"'P. BDI'!B8","v":"CNPJ:"},null,{"$f":"'P. BDI'!C8:F8","v":"xxxxxxxxxxxxx"}]
[{"$f":"'P. BDI'!B9","v":"Data base:"},null,{"$f":"'P. BDI'!C9:F9","v":"xxxxxxxxxxxxx"}]
["BDI :",null,{"$f":"QCI!C15","v":{"$error":"#VALUE!"}}]
[]
["ITEM .","REF.","DESCRIÇÃO","UN","VALOR UNIT.","QUANT.","VALOR UNIT C/ BDI","TOTAL"]
[]
[null,null,"PISO DA QUADRA"]
[".1",null,"SERVIÇOS PRELIMINARES",null,null,null,"TOTAL DO GRUPO:",{"$f":"SUM(H18:H22)","v":{"$error":"#VALUE!"}}]
[]
["1.1",4813,"PLACA DE OBRA (PARA CONSTRUCAO CIVIL) EM CHAPA GALVANIZADA *N. 22*, DE *2,0 X 1,125* M","M2",null,2.25,{"$f":"ROUND((E19*$C$12)+E19,2)","v":{"$error":"#VALUE!"}},{"$f":"ROUND(G19*F19,2)","v":{"$error":"#VALUE!"}}]
["1.2",94319,"ATERRO MANUAL COM SOLO, COMPACTADO PARA REGULARIZAÇÃO SUB-LEITO","M3",null,{"$f":"ROUND(F25*0.05,2)","v":21.16},{"$f":"ROUND((E20*$C$12)+E20,2)","v":{"$error":"#VALUE!"}},{"$f":"ROUND(G20*F20,2)","v":{"$error":"#VALUE!"}}]
["1.3",96396,"EXECUÇÃO E COMPACTAÇÃO DE BASE E OU SUB BASE COM BRITA GRADUADA SIMPLES","M3",null,{"$f":"ROUND(F25*0.06,2)","v":25.39},{"$error":"#VALUE!"},{"$error":"#VALUE!"}]
[]
[".2",null,"EXECUÇÃO DO PISO",null,null,null,"TOTAL DO GRUPO:",{"$f":"SUM(H24:H26)","v":{"$error":"#VALUE!"}}]
[]
["2.1","COMP. ","PISO EM CONCRETO 25MPA MOLDADO IN LOCO, ESPESSURA 9 CM, COM ARMACAO EM TELA SOLDADA Q-92, BARRA DE TRANF., JUNTAS MASTIQUE, POLIDO ","M2",null,{"$f":"ROUND(28.02*15.1,2)","v":423.1},{"$error":"#VALUE!"},{"$error":"#VALUE!"}]
[]
["VALOR TOTAL DA OBRA :",null,null,null,null,null,null,{"$f":"ROUND(H29/(1+C12),2)","v":{"$error":"#VALUE!"}}]
["BDI :",null,null,null,null,null,null,{"$f":"H29-H27","v":{"$error":"#VALUE!"}}]
["VALOR TOTAL DA OBRA COM BDI:",null,null,null,null,null,null,{"$f":"H17+H23","v":{"$error":"#VALUE!"}}]
[]
[]
[]
[]
[]
[]
[]
[null,null,null,"Responsável Técnico:",{"$f":"'P. BDI'!C39","v":"."}]
[null,null,null,"Carimbo e Assinatura CREA/CAU:",{"$f":"'P. BDI'!C40","v":"."}]
[]
[]
[]
[]
[]
[]
[]
[]
[null,null,null,"Responsavel Legal:",{"$f":"'P. BDI'!C45","v":"."}]
[null,null,null,"Carimbo e Assinatura",{"$f":"'P. BDI'!C46","v":"cpf:"}]

{"sheet":"QCI","index":2,"n_rows":53,"n_cols":8,"rows_kept":53,"cut":false,"hidden":false,"merged":[[12,0,12,1],[13,0,13,1],[14,0,14,1],[24,5,24,6],[26,3,26,4],[26,5,26,6],[24,3,24,4],[9,5,9,6],[9,3,9,4],[11,0,11,1],[9,0,9,1],[10,0,10,1],[1,0,2,7],[7,0,7,1],[7,3,7,4],[7,5,7,6],[8,0,8,1],[8,5,8,6],[8,3,8,4],[33,1,33,6],[34,1,34,6],[32,1,32,6],[29,5,29,6],[30,3,30,4],[29,3,29,4],[31,5,31,6],[31,3,31,4],[30,5,30,6],[28,3,28,4],[28,5,28,6],[25,5,25,6],[25,3,25,4],[27,3,27,4],[27,5,27,6]]}
["IMPRIMIR EM PAPEL TIMBRADO DA EMPRESA PROPONENTE "]
["QUADRO DE COMPOSIÇÃO DE INVESTIMENTO "]
[]
[]
[]
[]
[]
[{"$f":"'P. BDI'!B3","v":"Edital :"},null,{"$f":"'P. BDI'!C3:F3","v":"TP - 17/2018"},"Area:",null,{"$f":"Orçamento!F5","v":423.1},null,"m²"]
[{"$f":"'P. BDI'!B4","v":"Tomador: "},null,{"$f":"'P. BDI'!C4:F4","v":"Prefeitura Municipal de Dois Vizinhos - PR"},"Valor Tot. c/ BDI:",null,{"$f":"Orçamento!H29","v":{"$error":"#VALUE!"}}]
[{"$f":"'P. BDI'!B5","v":"Empreendimento: "},null,{"$f":"'P. BDI'!C5:F5","v":"Construção Piso Quadra  Escola Mun. 28 de Novembro"},"Custo R$/m2",null,{"$f":"F9/F8","v":{"$error":"#VALUE!"}}]
[{"$f":"'P. BDI'!B6","v":"Local da Obra:"},null,{"$f":"'P. BDI'!C6:F6","v":"Rua Padre Anchieta, 520, Dois Vizinhos PR"}]
[{"$f":"'P. BDI'!B7","v":"Empresa Prop.:"},null,{"$f":"'P. BDI'!C7:F7","v":"xxxxxxxxxxxxx"}]
[{"$f":"'P. BDI'!B8","v":"CNPJ:"},null,{"$f":"'P. BDI'!C8:F8","v":"xxxxxxxxxxxxx"}]
[{"$f":"'P. BDI'!B9","v":"Data base:"},null,{"$f":"'P. BDI'!C9:F9","v":"xxxxxxxxxxxxx"}]
["BDI :",null,{"$f":"'P. BDI'!F31","v":{"$error":"#VALUE!"}}]
[]
[]
[]
[]
[]
[]
[]
[]
[]
[null,"ITEM .","DESCRIÇÃO ","% DO GRUPO",null,"VALOR DO GRUPO:",null,"TOTAL ACUM."]
[null,{"$f":"Orçamento!A17","v":".1"},{"$f":"Orçamento!C17","v":"SERVIÇOS PRELIMINARES"},{"$f":"F26/$H$35","v":{"$error":"#VALUE!"}},null,{"$f":"Orçamento!H17","v":{"$error":"#VALUE!"}},null,{"$f":"F26+H28","v":{"$error":"#VALUE!"}}]
[null,{"$f":"Orçamento!A23","v":".2"},{"$f":"Orçamento!C23","v":"EXECUÇÃO DO PISO"},{"$f":"F27/$H$35","v":{"$error":"#VALUE!"}},null,{"$f":"Orçamento!H23","v":{"$error":"#VALUE!"}},null,{"$f":"F27+H26","v":{"$error":"#VALUE!"}}]
[]
[]
[]
[]
[]
[null,"VALOR TOTAL DA OBRA :",null,null,null,null,null,{"$f":"Orçamento!H27","v":{"$error":"#VALUE!"}}]
[null,"BDI :",null,null,null,null,null,{"$f":"Orçamento!H28","v":{"$error":"#VALUE!"}}]
[null,"VALOR TOTAL DA OBRA COM BDI:",null,null,null,null,null,{"$f":"SUM(F26:G32)","v":{"$error":"#VALUE!"}}]
[]
[]
[]
[]
[]
[]
[]
[]
[null,null,null,"Responsável Técnico:",{"$f":"'P. BDI'!C39","v":"."}]
[null,null,null,"Carimbo e Assinatura CREA/CAU:",{"$f":"'P. BDI'!C40","v":"."}]
[]
[]
[]
[]
[]
[]
[null,null,null,"Responsavel Legal:",{"$f":"'P. BDI'!C45","v":"."}]
[null,null,null,"Carimbo e Assinatura",{"$f":"'P. BDI'!C46","v":"cpf:"}]

{"sheet":"CRON","index":3,"n_rows":44,"n_cols":11,"rows_kept":44,"cut":false,"hidden":false,"merged":[[22,1,22,3],[22,4,22,5],[1,0,2,10],[10,0,10,1],[11,0,11,1],[7,0,7,1],[5,5,5,6],[9,0,9,1],[4,0,4,1],[4,3,4,4],[4,5,4,6],[5,0,5,1],[5,3,5,4],[6,0,6,1],[6,3,6,4],[6,5,6,6],[8,0,8,1],[14,2,14,3],[14,4,14,5],[16,4,16,5],[16,2,16,3],[17,4,17,5],[15,4,15,5],[19,4,19,5],[20,4,20,5],[21,4,21,5],[18,4,18,5],[17,2,17,3],[15,2,15,3],[19,2,19,3],[20,2,20,3],[21,2,21,3]]}
["IMPRIMIR EM PAPEL TIMBRADO DA EMPRESA PROPONENTE "]
["CRONOGRAMA FÍSICO-FINANCEIRO "]
[]
[]
[{"$f":"'P. BDI'!B3","v":"Edital :"},null,{"$f":"'P. BDI'!C3:F3","v":"TP - 17/2018"},"Area:",null,{"$f":"Orçamento!F5","v":423.1}]
[{"$f":"'P. BDI'!B4","v":"Tomador: "},null,{"$f":"'P. BDI'!C4:F4","v":"Prefeitura Municipal de Dois Vizinhos - PR"},"Valor Tot. c/ BDI:",null,{"$f":"Orçamento!H29","v":{"$error":"#VALUE!"}}]
[{"$f":"'P. BDI'!B5","v":"Empreendimento: "},null,{"$f":"'P. BDI'!C5:F5","v":"Construção Piso Quadra  Escola Mun. 28 de Novembro"},"Custo R$/m2",null,{"$f":"F6/F5","v":{"$error":"#VALUE!"}}]
[{"$f":"'P. BDI'!B6","v":"Local da Obra:"},null,{"$f":"'P. BDI'!C6:F6","v":"Rua Padre Anchieta, 520, Dois Vizinhos PR"}]
[{"$f":"'P. BDI'!B7","v":"Empresa Prop.:"},null,{"$f":"'P. BDI'!C7:F7","v":"xxxxxxxxxxxxx"}]
[{"$f":"'P. BDI'!B8","v":"CNPJ:"},null,{"$f":"'P. BDI'!C8:F8","v":"xxxxxxxxxxxxx"}]
[{"$f":"'P. BDI'!B9","v":"Data base:"},null,{"$f":"'P. BDI'!C9:F9","v":"xxxxxxxxxxxxx"}]
["BDI :",null,{"$f":"'P. BDI'!F31","v":{"$error":"#VALUE!"}}]
[]
[]
[null,"ITEM","DESCRIÇÃO ",null,"VALOR DO GRUPO",null,"MÊS °1","MÊS °2","MÊS °3","MÊS °3","% TOTAL"]
[null,{"$f":"QCI!B26","v":".1"},{"$f":"QCI!C26","v":"SERVIÇOS PRELIMINARES"},null,{"$f":"QCI!F26","v":{"$error":"#VALUE!"}},null,1,null,null,null,{"$f":"SUM(G16:J16)","v":1}]
[null,{"$f":"QCI!B27","v":".2"},{"$f":"QCI!C27","v":"EXECUÇÃO DO PISO"},null,{"$f":"QCI!F27","v":{"$error":"#VALUE!"}},null,0.8,0.2,null,null,{"$f":"SUM(G17:J17)","v":1}]
[]
[]
[]
[]
[]
[null,"TOTAL:",null,null,null,null,{"$f":"G17*E17+G18*E18+G16*E16+G20*E20+G21*E21+G22*E22","v":{"$error":"#VALUE!"}},{"$f":"+H17*E17+H18*E18+H16*E16+H20*E20+H21*E21+H22*E22","v":{"$error":"#VALUE!"}},{"$f":"I17*E17+I18*E18+I16*E16+I20*E20+I21*E21+I22*E22","v":{"$error":"#VALUE!"}},{"$f":"E16*J16","v":{"$error":"#VALUE!"}},{"$f":"SUM(G23:J23)","v":{"$error":"#VALUE!"}}]
[]
[]
[]
[]
[]
[]
[]
[]
[null,null,null,null,null,"Responsável Técnico:",{"$f":"'P. BDI'!C39","v":"."}]
[null,null,null,null,null,"Carimbo e Assinatura CREA/CAU:",{"$f":"'P. BDI'!C40","v":"."}]
[]
[]
[]
[]
[]
[]
[]
[]
[]
[null,null,null,null,null,"Responsavel Legal:",{"$f":"'P. BDI'!C45","v":"."}]
[null,null,null,null,null,"Carimbo e Assinatura",{"$f":"'P. BDI'!C46","v":"cpf:"}]