{"text_format":"1","workbook":"xlsx","n_sheets":4,"sheets":["P. BDI","Orçamento ","QCI","CRON"],"not_rendered":{"charts":0,"images":0,"macros":1,"external_links":1,"defined_names":26,"comments":2,"pivot_tables":0},"unopened":[],"bounds":{"document_bytes":16777216,"sheet_cells":100000,"rows_first":2000,"rows_last":500,"rows_between":2000,"halvings":0,"cell_chars":16384,"cell_head_chars":4096},"cells_cut":0,"cells_raw":0,"read":"whole","date_system":"1900"}

{"sheet":"P. BDI","index":0,"n_rows":50,"n_cols":10,"rows_kept":50,"cut":false,"hidden":false,"merged":[[34,1,34,5],[35,1,35,5],[14,3,14,5],[18,2,18,4],[25,1,25,4],[26,1,26,4],[27,1,27,4],[29,1,29,4],[11,3,11,5],[6,2,6,5],[7,2,7,5],[30,1,30,4],[32,1,32,5],[1,1,1,5],[2,2,2,5],[3,2,3,5],[4,2,4,5],[5,2,5,5]]}
[null,"IMPRIMIR EM PAPEL TIMBRADO DA EMPRESA PROPONENTE "]
[null,"BDI - Bonificações e Despesas Indiretas"]
[null,"Edital :","TP -17/2018 Lote 2"]
[null,"Tomador: ","Prefeitura Municipal de Dois Vizinhos - PR"]
[null,"Empreendimento: ","ESTRUTURA PARA CAIXA D'AGUA"]
[null,"Local da Obra:","Vila Rural Verdes Campos"]
[null,"Empresa Prop.:","xxxxxxxxxxxxxx"]
[null,"CNPJ:","xxxxxxxxxxxxxx"]
[null,"Data base:","xxxxxxxxxxxxxx"]
[]
[null,"Identifique o tipo de obra:",1,{"$f":"IF(C11>0,IF(C11<7,,\"<--- Insira valor entre 1 e 6\"),\"<--- Insira valor entre 1 e 6\")","v":0}]
[null,"Construção de edifícios:",1,"Informe a base de cálculo do ISSQN."]
[null,"Construção de rodovias e ferrovias:",2,{"$f":"IF(D14<>0,0,\"( X )\")","v":0},"Sobre os serviços."]
[null,"Construção de redes de abastecimento de água, coleta de esgoto e construções correlatas:",3,"x","Sobre a mão-de-obra."]
[null,"Construção e manutenção de estações e redes de distribuição de energia elétrica:",4,"Informe a ocorrência da DESONERAÇÃO da folha de pagamento. Lei 12844/2013."]
[null,"Obras portuárias, marítimas e fluviais:",5,{"$f":"IF(D17<>0,0,\"( X )\")","v":0},"SEM Desoneração."]
[null,"Fornecimento de materiais e equipamentos:",6,"x","COM Desoneração."]
[]
[null,null,"Intervalo de admissibilidade",null,null,null,null,"Ac",{"$f":"F21","v":"preencher"}]
[null,"Item Componente do BDI","1º Quartil","Médio","3º Quartil","Valores Propostos",null,"S",{"$f":"F22","v":"preencher"}]
[null,"Administração Central",0.03,0.04,5.5E-2,"preencher",{"$f":"IF(F21=0,\"\",IF(F21<C21,\"Atenção, observar os intervalos!\",IF(F21>E21,\"Atenção, observar os intervalos!\",\"\")))","v":"Atenção, observar os intervalos!"},"G",{"$f":"I20","v":"preencher"}]
[null,"Seguro e Garantia",8.0000000000000002E-3,8.0000000000000002E-3,0.01,"preencher",{"$f":"IF(F22=0,\"\",IF(F22<C22,\"Atenção, observar os intervalos!\",IF(F22>E22,\"Atenção, observar os intervalos!\",\"\")))","v":"Atenção, observar os intervalos!"},"R",{"$f":"F23","v":"preencher"}]
[null,"Risco",9.7000000000000003E-3,1.2699999999999999E-2,1.2699999999999999E-2,"preencher",{"$f":"IF(F23=0,\"\",IF(F23<C23,\"Atenção, observar os intervalos!\",IF(F23>E23,\"Atenção, observar os intervalos!\",\"\")))","v":"Atenção, observar os intervalos!"},"DF","preencher"]
[null,"Despesas Financeiras",5.8999999999999999E-3,1.23E-2,1.3899999999999999E-2,"preencher",{"$f":"IF(F24=0,\"\",IF(F24<C24,\"Atenção, observar os intervalos!\",IF(F24>E24,\"Atenção, observar os intervalos!\",\"\")))","v":"Atenção, observar os intervalos!"},"L","preencher"]
[null,"Lucro",6.1600000000000002E-2,7.3999999999999996E-2,8.9599999999999999E-2,"preencher",{"$f":"IF(F25=0,\"\",IF(F25<C25,\"Atenção, observar os intervalos!\",IF(F25>E25,\"Atenção, observar os intervalos!\",\"\")))","v":"Atenção, observar os intervalos!"},"l1","preencher"]
[null,"I1: PIS e COFINS",null,null,null,"preencher",null,"l2","preencher"]
[null,"I2: ISSQN (conforme legislação municipal)",null,null,null,"preencher",null,"l3",4.4999999999999998E-2]
[null,"I3: Cont.Prev s/Rec.Bruta (Lei 12844/13 - Desoneração)",null,null,null,4.4999999999999998E-2]
[]
[null,"BDI - SEM Desoneração da folha de pagamento",null,null,null,{"$f":"ROUND((((1+I19+I21+I22)*(1+I23)*(1+I24))/(1-I25-I26))-1,4)","v":{"$error":"#VALUE!"}},null,"1º QUARTIL","MÉDIO","3º QUARTIL"]
[null,"BDI - COM Desoneração da folha de pagamento",null,null,null,{"$f":"ROUND((((1+I19+I21+I22)*(1+I23)*(1+I24))/(1-I25-I26-I27))-1,4)","v":{"$error":"#VALUE!"}},null,0.2034,0.22120000000000001,0.25]
[]
[null,"Declaramos que esta planilha foi elaborada conforme equação para cálculo do percentual do BDI recomendada pelo Acórdão 2622/2013 - TCU, representada pela fórmula abaixo."]
[]
[null,"BDI - SEM Desoneração = [(1+AC+S+G+R)X(1+DF)X(1+L)/(1-I1-I2)]-1"]
[null,"BDI - COM Desoneração = [(1+AC+S+G+R)X(1+DF)X(1+L)/(1-I1-I2-I3)]-1"]
[]
[]
[]
[]
[null,"Responsável Técnico:","."]
[null,"Carimbo e Assinatura CREA/CAU:","."]
[]
[]
[]
[]
[]
[]
[null,"Responsavel Legal:","."]
[null,"Carimbo e Assinatura","cpf:"]

{"sheet":"Orçamento ","index":1,"n_rows":56,"n_cols":8,"rows_kept":56,"cut":false,"hidden":false,"merged":[[32,0,32,6],[33,0,33,6],[8,4,8,7],[31,0,31,6],[9,0,9,1],[10,0,10,1],[8,0,8,1],[11,0,11,1],[1,0,2,7],[4,0,4,1],[5,0,5,1],[6,0,6,1],[7,0,7,1],[4,3,4,4],[5,3,5,4]]}
["IMPRIMIR EM PAPEL TIMBRADO DA EMPRESA PROPONENTE "]
["PLANILHA ORÇAMENTARIA"]
[]
[]
[{"$f":"'P. BDI'!B3","v":"Edital :"},null,{"$f":"'P. BDI'!C3:F3","v":"TP -17/2018 Lote 2"}]
[{"$f":"'P. BDI'!B4","v":"Tomador: "},null,{"$f":"'P. BDI'!C4:F4","v":"Prefeitura Municipal de Dois Vizinhos - PR"}]
[{"$f":"'P. BDI'!B5","v":"Empreendimento: "},null,{"$f":"'P. BDI'!C5:F5","v":"ESTRUTURA PARA CAIXA D'AGUA"}]
[{"$f":"'P. BDI'!B6","v":"Local da Obra:"},null,{"$f":"'P. BDI'!C6:F6","v":"Vila Rural Verdes Campos"}]
[{"$f":"'P. BDI'!B7","v":"Empresa Prop.:"},null,{"$f":"'P. BDI'!C7:F7","v":"xxxxxxxxxxxxxx"}]
[{"$f":"'P. BDI'!B8","v":"CNPJ:"},null,{"$f":"'P. BDI'!C8:F8","v":"xxxxxxxxxxxxxx"}]
[{"$f":"'P. BDI'!$B$9","v":"Data base:"},null,{"$f":"'P. BDI'!C9","v":"xxxxxxxxxxxxxx"}]
["BDI :",null,{"$f":"'P. BDI'!F31","v":{"$error":"#VALUE!"}}]
[]
["ITEM .","REF.","DESCRIÇÃO","UN","VALOR UNIT.","QUANT.","VALOR UNIT C/ BDI","TOTAL"]
[]
[".1",null,"SERVIÇOS PRELIMINARES",null,null,null,"TOTAL DO GRUPO:",{"$f":"SUM(H17:H17)","v":{"$error":"#VALUE!"}}]
["1.1","74077/2","LOCACAO CONVENCIONAL DE OBRA, ATRAVÉS DE GABARITO DE TABUAS CORRIDAS PONTALETADAS, COM REAPROVEITAMENTO.","M2",null,{"$f":"4*4","v":16},{"$f":"ROUND((E17*$C$12)+E17,2)","v":{"$error":"#VALUE!"}},{"$f":"ROUND(G17*F17,3)","v":{"$error":"#VALUE!"}}]
[".2",null,"ESTRUTURAS DE CONCRETO ARMADO",null,null,null,"TOTAL DO GRUPO:",{"$f":"SUM(H19:H30)","v":{"$error":"#VALUE!"}}]
["2.1",93358,"ESCAVAÇÃO MANUAL DE VALAS. AF_03/2016","M3",null,{"$f":"ROUND((1*1*1.2)*3,2)","v":3.6},{"$f":"ROUND((E19*$C$12)+E19,2)","v":{"$error":"#VALUE!"}},{"$f":"ROUND(G19*F19,3)","v":{"$error":"#VALUE!"}}]
["2.2",90880,"ESTACA ESCAVADA MECANICAMENTE, COM 25 CM DE DIÂMETRO, CONCRETO LANÇADO MANUALMENTE,","M",null,3,{"$error":"#VALUE!"},{"$error":"#VALUE!"}]
["2.3",96536,"FABRICAÇÃO, MONTAGEM E DESMONTAGEM DE FÔRMA PARA ESTRUTURAS, EM MADEIRA SERRADA, E=25 MM, 4 UTILIZAÇÕES. AF_06/2017","M2",null,42.81,{"$error":"#VALUE!"},{"$error":"#VALUE!"}]
["2.4",94965,"CONCRETO FCK = 25MPA, TRAÇO 1:2,3:2,7 (CIMENTO/ AREIA MÉDIA/ BRITA 1)  - PREPARO MECÂNICO COM BETONEIRA 400 L. AF_07/2016","M3",null,1.23,{"$error":"#VALUE!"},{"$f":"ROUND(G22*F22,3)","v":{"$error":"#VALUE!"}}]
["2.5",94966,"CONCRETO FCK = 30MPA, TRAÇO 1:2,1:2,5 (CIMENTO/ AREIA MÉDIA/ BRITA 1)  - PREPARO MECÂNICO COM BETONEIRA 400 L. AF_07/2016","M3",null,2.06,{"$error":"#VALUE!"},{"$error":"#VALUE!"}]
["2.6",92792,"CORTE E DOBRA DE AÇO CA-50, DIÂMETRO DE 6.3 MM, UTILIZADO EM ESTRUTURAS DIVERSAS","KG",null,82.2,{"$error":"#VALUE!"},{"$f":"ROUND(G24*F24,3)","v":{"$error":"#VALUE!"}}]
["2.7",92793,"CORTE E DOBRA DE AÇO CA-50, DIÂMETRO DE 8.0 MM, UTILIZADO EM ESTRUTURAS DIVERSAS","KG",null,28,{"$error":"#VALUE!"},{"$error":"#VALUE!"}]
["2.8",92794,"CORTE E DOBRA DE AÇO CA-50, DIÂMETRO DE 10.0 MM, UTILIZADO EM ESTRUTURAS DIVERSAS","KG",null,54.5,{"$error":"#VALUE!"},{"$error":"#VALUE!"}]
["2.9",92795,"CORTE E DOBRA DE AÇO CA-50, DIÂMETRO DE 12.5 MM, UTILIZADO EM ESTRUTURAS DIVERSAS","KG",null,163.30000000000001,{"$error":"#VALUE!"},{"$error":"#VALUE!"}]
["2.10",92791,"CORTE E DOBRA DE AÇO CA-60, DIÂMETRO DE 5.0 MM, UTILIZADO EM ESTRUTURAS DIVERSAS","KG",null,21.2,{"$error":"#VALUE!"},{"$error":"#VALUE!"}]
["2.11",96995,"REATERRO MANUAL APILOADO","M3",null,{"$f":"ROUND(F19-(0.7*0.7*0.25*3),2)","v":3.23},{"$error":"#VALUE!"},{"$error":"#VALUE!"}]
["2.12",88489,"APLICAÇÃO MANUAL DE PINTURA COM TINTA LÁTEX ACRÍLICA, DUAS DEMAOS","M2",null,{"$f":"ROUND((1*5)+(0.68*9.45*2)+(5),2)","v":22.85},{"$error":"#VALUE!"},{"$error":"#VALUE!"}]
[]
["VALOR TOTAL DA OBRA :",null,null,null,null,null,null,{"$f":"H34/(1+C12)","v":{"$error":"#VALUE!"}}]
["BDI :",null,null,null,null,null,null,{"$f":"ROUND(H32*C12,2)","v":{"$error":"#VALUE!"}}]
["VALOR TOTAL DA OBRA COM BDI:",null,null,null,null,null,null,{"$f":"H16+H18","v":{"$error":"#VALUE!"}}]
[]
[]
[]
[]
[]
[]
[]
[]
[]
[]
[null,null,null,"Responsável Técnico:",{"$f":"'P. BDI'!C41","v":"."}]
[null,null,null,"Carimbo e Assinatura CREA/CAU:",{"$f":"'P. BDI'!C42","v":"."}]
[]
[]
[]
[]
[]
[]
[]
[]
[null,null,null,"Responsavel Legal:",{"$f":"'P. BDI'!C49","v":"."}]
[null,null,null,"Carimbo e Assinatura",{"$f":"'P. BDI'!C50","v":"cpf:"}]

{"sheet":"QCI","index":2,"n_rows":50,"n_cols":8,"rows_kept":50,"cut":false,"hidden":false,"merged":[[31,5,31,6],[32,5,32,6],[33,3,33,4],[36,1,36,2],[35,5,35,6],[36,5,36,6],[36,3,36,4],[34,5,34,6],[35,3,35,4],[31,3,31,4],[32,3,32,4],[34,3,34,4],[33,5,33,6],[11,0,11,1],[9,0,9,1],[10,0,10,1],[30,3,30,4],[9,3,9,4],[12,0,12,1],[13,0,13,1],[24,5,24,6],[25,5,25,6],[28,5,28,6],[29,5,29,6],[14,0,14,1],[30,5,30,6],[27,3,27,4],[27,5,27,6],[1,0,2,7],[7,0,7,1],[7,3,7,4],[7,5,7,6],[8,0,8,1],[8,5,8,6],[28,3,28,4],[29,3,29,4],[8,3,8,4],[26,3,26,4],[26,5,26,6],[24,3,24,4],[25,3,25,4]]}
["IMPRIMIR EM PAPEL TIMBRADO DA EMPRESA PROPONENTE "]
["QUADRO DE COMPOSIÇÃO DE INVESTIMENTO "]
[]
[]
[]
[]
[]
[{"$f":"'P. BDI'!B3","v":"Edital :"},null,{"$f":"'P. BDI'!C3:F3","v":"TP -17/2018 Lote 2"},"Valor Tot. s/ BDI:",null,{"$f":"'Orçamento '!H32","v":{"$error":"#VALUE!"}}]
[{"$f":"'P. BDI'!B4","v":"Tomador: "},null,{"$f":"'P. BDI'!C4:F4","v":"Prefeitura Municipal de Dois Vizinhos - PR"},"Valor Tot. c/ BDI:",null,{"$f":"'Orçamento '!H34","v":{"$error":"#VALUE!"}}]
[{"$f":"'P. BDI'!B5","v":"Empreendimento: "},null,{"$f":"'P. BDI'!C5:F5","v":"ESTRUTURA PARA CAIXA D'AGUA"}]
[{"$f":"'P. BDI'!B6","v":"Local da Obra:"},null,{"$f":"'P. BDI'!C6:F6","v":"Vila Rural Verdes Campos"}]
[{"$f":"'P. BDI'!B7","v":"Empresa Prop.:"},null,{"$f":"'P. BDI'!C7:F7","v":"xxxxxxxxxxxxxx"}]
[{"$f":"'P. BDI'!B8","v":"CNPJ:"},null,{"$f":"'P. BDI'!C8:F8","v":"xxxxxxxxxxxxxx"}]
[{"$f":"'P. BDI'!$B$9","v":"Data base:"},null,{"$f":"'P. BDI'!C9:F9","v":"xxxxxxxxxxxxxx"}]
["BDI :",null,{"$f":"'Orçamento '!C12","v":{"$error":"#VALUE!"}}]
[]
[]
[]
[]
[]
[]
[]
[]
[]
[null,"ITEM .","DESCRIÇÃO ","% DO GRUPO",null,"VALOR DO GRUPO:",null,"TOTAL ACUM."]
[null,{"$f":"'Orçamento '!A16","v":".1"},{"$f":"'Orçamento '!C16","v":"SERVIÇOS PRELIMINARES"},{"$f":"F26/$F$37","v":{"$error":"#VALUE!"}},null,{"$f":"'Orçamento '!H16","v":{"$error":"#VALUE!"}},null,{"$f":"F26","v":{"$error":"#VALUE!"}}]
[null,{"$f":"'Orçamento '!A18","v":".2"},{"$f":"'Orçamento '!C18","v":"ESTRUTURAS DE CONCRETO ARMADO"},{"$f":"F27/$F$37","v":{"$error":"#VALUE!"}},null,{"$f":"'Orçamento '!H18","v":{"$error":"#VALUE!"}},null,{"$f":"F27+H26","v":{"$error":"#VALUE!"}}]
[]
[]
[]
[]
[]
[]
[]
[]
[]
[null,"TOTAL :",null,{"$f":"SUM(D26:E31)","v":{"$error":"#VALUE!"}},null,{"$f":"SUM(F26:G31)","v":{"$error":"#VALUE!"}},null,{"$f":"H27","v":{"$error":"#VALUE!"}}]
[]
[]
[]
[]
[]
[null,null,null,"Responsável Técnico:",{"$f":"'P. BDI'!C41","v":"."}]
[null,null,null,"Carimbo e Assinatura CREA/CAU:",{"$f":"'P. BDI'!C42","v":"."}]
[]
[]
[]
[]
[null,null,null,"Responsavel Legal:",{"$f":"'P. BDI'!C49","v":"."}]
[null,null,null,"Carimbo e Assinatura",{"$f":"'P. BDI'!C50","v":"cpf:"}]

{"sheet":"CRON","index":3,"n_rows":55,"n_cols":16,"rows_kept":55,"cut":false,"hidden":false,"merged":[[26,2,26,3],[29,4,29,5],[29,2,29,3],[28,4,28,5],[28,2,28,3],[27,2,27,3],[26,4,26,5],[27,4,27,5],[32,1,32,3],[32,4,32,5],[30,4,30,5],[31,4,31,5],[30,1,30,3],[31,1,31,3],[8,0,8,1],[15,4,15,5],[16,4,16,5],[24,2,24,3],[16,2,16,3],[17,2,17,3],[17,4,17,5],[25,2,25,3],[18,4,18,5],[19,4,19,5],[25,4,25,5],[23,2,23,3],[23,4,23,5],[18,2,18,3],[19,2,19,3],[21,2,21,3],[22,2,22,3],[21,4,21,5],[22,4,22,5],[20,2,20,3],[20,4,20,5],[24,4,24,5],[1,0,2,15],[10,0,10,1],[11,0,11,1],[14,2,14,3],[15,2,15,3],[7,0,7,1],[5,5,5,6],[9,0,9,1],[14,4,14,5],[4,0,4,1],[4,3,4,4],[4,5,4,6],[5,0,5,1],[5,3,5,4],[6,0,6,1],[6,3,6,4]]}
["IMPRIMIR EM PAPEL TIMBRADO DA EMPRESA PROPONENTE "]
["CRONOGRAMA FÍSICO-FINANCEIRO "]
[]
[]
[{"$f":"'P. BDI'!B3","v":"Edital :"},null,{"$f":"'P. BDI'!C3:F3","v":"TP -17/2018 Lote 2"},"Valor Tot. s/ BDI:",null,{"$f":"'Orçamento '!H32","v":{"$error":"#VALUE!"}}]
[{"$f":"'P. BDI'!B4","v":"Tomador: "},null,{"$f":"'P. BDI'!C4:F4","v":"Prefeitura Municipal de Dois Vizinhos - PR"},"Valor Tot. c/ BDI:",null,{"$f":"'Orçamento '!H34","v":{"$error":"#VALUE!"}}]
[{"$f":"'P. BDI'!B5","v":"Empreendimento: "},null,{"$f":"'P. BDI'!C5:F5","v":"ESTRUTURA PARA CAIXA D'AGUA"}]
[{"$f":"'P. BDI'!B6","v":"Local da Obra:"},null,{"$f":"'P. BDI'!C6:F6","v":"Vila Rural Verdes Campos"}]
[{"$f":"'P. BDI'!B7","v":"Empresa Prop.:"},null,{"$f":"'P. BDI'!C7:F7","v":"xxxxxxxxxxxxxx"}]
[{"$f":"'P. BDI'!B8","v":"CNPJ:"},null,{"$f":"'P. BDI'!C8:F8","v":"xxxxxxxxxxxxxx"}]
[{"$f":"'P. BDI'!$B$9","v":"Data base:"},null,{"$f":"'P. BDI'!C9:F9","v":"xxxxxxxxxxxxxx"}]
["BDI .:",null,{"$f":"'Orçamento '!C12","v":{"$error":"#VALUE!"}}]
[]
[]
[null,"ITEM .","DESCRIÇÃO ",null,"VALOR DO GRUPO",null,"MÊS °1","MÊS °2","MÊS °3","MÊS °4","MÊS °5","MÊS °6","MÊS °7","MÊS °8","MÊS °9","% TOTAL"]
[null,{"$f":"QCI!B26","v":".1"},{"$f":"QCI!C26","v":"SERVIÇOS PRELIMINARES"},null,{"$f":"QCI!F26","v":{"$error":"#VALUE!"}},null,1,null,null,null,null,null,null,null,null,{"$f":"SUM(G16:O16)","v":1}]
[null,{"$f":"QCI!B27","v":".2"},{"$f":"QCI!C27","v":"ESTRUTURAS DE CONCRETO ARMADO"},null,{"$f":"QCI!F27","v":{"$error":"#VALUE!"}},null,0.75,0.25,null,null,null,null,null,null,null,{"$f":"SUM(G17:O17)","v":1}]
[]
[]
[]
[]
[]
[]
[]
[]
[]
[]
[]
[]
[]
[null,"% TOTAL DE EXECUÇÃO:",null,null,1,null,{"$f":"G32/$E$32","v":{"$error":"#VALUE!"}},{"$f":"H32/$E$32","v":{"$error":"#VALUE!"}},{"$error":"#VALUE!"},{"$error":"#VALUE!"},{"$f":"K32/$E$32","v":{"$error":"#VALUE!"}},{"$error":"#VALUE!"},{"$error":"#VALUE!"},{"$error":"#VALUE!"},{"$error":"#VALUE!"}]
[null,"TOTAL:",null,null,{"$f":"SUM(E16:F30)","v":{"$error":"#VALUE!"}},null,{"$f":"(G16*$E$16)+(G17*$E$17)+(G19*$E$19)+(G20*$E$20)+(G21*$E$21)+(G18*$E$18)+(G26*$E$26)+(G27*$E$27)+(G28*$E$28)+(G29*$E$29)+(G30*$E$30)","v":{"$error":"#VALUE!"}},{"$f":"(H16*$E$16)+(H17*$E$17)+(H19*$E$19)+(H20*$E$20)+(H21*$E$21)+(H18*$E$18)+(H26*$E$26)+(H27*$E$27)+(H28*$E$28)+(H29*$E$29)+(H30*$E$30)","v":{"$error":"#VALUE!"}},{"$f":"(I16*$E$16)+(I17*$E$17)+(I19*$E$19)+(I20*$E$20)+(I21*$E$21)+(I18*$E$18)+(I26*$E$26)+(I27*$E$27)+(I28*$E$28)+(I29*$E$29)+(I30*$E$30)","v":{"$error":"#VALUE!"}},{"$f":"(J16*$E$16)+(J17*$E$17)+(J19*$E$19)+(J20*$E$20)+(J21*$E$21)+(J18*$E$18)+(J26*$E$26)+(J27*$E$27)+(J28*$E$28)+(J29*$E$29)+(J30*$E$30)","v":{"$error":"#VALUE!"}},{"$f":"(K16*$E$16)+(K17*$E$17)+(K19*$E$19)+(K20*$E$20)+(K21*$E$21)+(K18*$E$18)+(K26*$E$26)+(K27*$E$27)+(K28*$E$28)+(K29*$E$29)+(K30*$E$30)","v":{"$error":"#VALUE!"}},{"$f":"(L16*$E$16)+(L17*$E$17)+(L19*$E$19)+(L20*$E$20)+(L21*$E$21)+(L25*$E$25)+(L26*$E$26)+(L27*$E$27)+(L28*$E$28)+(L29*$E$29)+(L30*$E$30)","v":{"$error":"#VALUE!"}},{"$error":"#VALUE!"},{"$error":"#VALUE!"},{"$error":"#VALUE!"}]
[null,"TOTAL ACUM.:",null,null,null,null,{"$f":"G32","v":{"$error":"#VALUE!"}},{"$f":"H32+G33","v":{"$error":"#VALUE!"}},{"$f":"I32+H33","v":{"$error":"#VALUE!"}},{"$f":"J32+I33","v":{"$error":"#VALUE!"}},{"$f":"K32+J33","v":{"$error":"#VALUE!"}},{"$f":"L32+K33","v":{"$error":"#VALUE!"}},{"$error":"#VALUE!"},{"$error":"#VALUE!"},{"$error":"#VALUE!"}]
[]
[]
[]
[]
[]
[]
[]
[]
[]
[null,null,null,null,null,"Responsável Técnico:",{"$f":"'P. BDI'!C41","v":"."}]
[null,null,null,null,null,"Carimbo e Assinatura CREA/CAU:",{"$f":"'P. BDI'!C42","v":"."}]
[]
[]
[]
[]
[]
[]
[]
[]
[]
[null,null,null,null,null,"Responsavel Legal:",{"$f":"'P. BDI'!C49","v":"."}]
[null,null,null,null,null,"Carimbo e Assinatura",{"$f":"'P. BDI'!C50","v":"cpf:"}]