{"text_format":"1","workbook":"xlsx","n_sheets":6,"sheets":["P. BDI 1","P. BDI 2","P. BDI 3","PONTE","QCI","CRON"],"not_rendered":{"charts":0,"images":0,"macros":1,"external_links":2,"defined_names":48,"comments":2,"pivot_tables":0},"unopened":[],"bounds":{"document_bytes":16777216,"sheet_cells":100000,"rows_first":2000,"rows_last":500,"rows_between":2000,"halvings":0,"cell_chars":16384,"cell_head_chars":4096},"cells_cut":0,"cells_raw":0,"read":"whole","date_system":"1900"}

{"sheet":"P. BDI 1","index":0,"n_rows":52,"n_cols":10,"rows_kept":52,"cut":false,"hidden":true,"merged":[[34,1,34,5],[35,1,35,5],[14,3,14,5],[18,2,18,4],[25,1,25,4],[26,1,26,4],[27,1,27,4],[29,1,29,4],[11,3,11,5],[6,2,6,5],[7,2,7,5],[30,1,30,4],[32,1,32,5],[8,2,8,5],[1,1,1,5],[2,2,2,5],[3,2,3,5],[4,2,4,5],[5,2,5,5]]}
[null,"IMPRIMIR EM PAPEL TIMBRADO DA EMPRESA PROPONENTE "]
[null,"BDI - Bonificações e Despesas Indiretas"]
[null,"Edital :"," -xxx"]
[null,"Tomador: ","Prefeitura Municipal de Dois Vizinhos - PR"]
[null,"Empreendimento: ","Revitalização Vias Urbanas"]
[null,"Local da Obra:","Dois Vizinhos - Pr"]
[null,"Empresa Prop.:","xxxxxxxxxxxxxx"]
[null,"CNPJ:","xxxxxxxxxxxxxx"]
[null,"Referencia:","Sinapi 08/2018 desonerado"]
[]
[null,"Identifique o tipo de obra:",1,{"$f":"IF(C11>0,IF(C11<7,,\"<--- Insira valor entre 1 e 6\"),\"<--- Insira valor entre 1 e 6\")","v":0}]
[null,"Construção de edifícios:",1,"Informe a base de cálculo do ISSQN."]
[null,"Construção de rodovias e ferrovias:",2,{"$f":"IF(D14<>0,0,\"( X )\")","v":0},"Sobre os serviços."]
[null,"Construção de redes de abastecimento de água, coleta de esgoto e construções correlatas:",3,"x","Sobre a mão-de-obra."]
[null,"Construção e manutenção de estações e redes de distribuição de energia elétrica:",4,"Informe a ocorrência da DESONERAÇÃO da folha de pagamento. Lei 12844/2013."]
[null,"Obras portuárias, marítimas e fluviais:",5,{"$f":"IF(D17<>0,0,\"( X )\")","v":0},"SEM Desoneração."]
[null,"Fornecimento de materiais e equipamentos:",6,"x","COM Desoneração."]
[]
[null,null,"Intervalo de admissibilidade",null,null,null,null,"Ac",{"$f":"F21","v":0.03}]
[null,"Item Componente do BDI","1º Quartil","Médio","3º Quartil","Valores Propostos",null,"S",{"$f":"F22","v":8.0000000000000002E-3}]
[null,"Administração Central",0.03,0.04,5.5E-2,0.03,{"$f":"IF(F21=0,\"\",IF(F21<C21,\"Atenção, observar os intervalos!\",IF(F21>E21,\"Atenção, observar os intervalos!\",\"\")))","v":""},"G",{"$f":"I20","v":8.0000000000000002E-3}]
[null,"Seguro e Garantia",8.0000000000000002E-3,8.0000000000000002E-3,0.01,8.0000000000000002E-3,{"$f":"IF(F22=0,\"\",IF(F22<C22,\"Atenção, observar os intervalos!\",IF(F22>E22,\"Atenção, observar os intervalos!\",\"\")))","v":""},"R",{"$f":"F23","v":9.7000000000000003E-3}]
[null,"Risco",9.7000000000000003E-3,1.2699999999999999E-2,1.2699999999999999E-2,9.7000000000000003E-3,{"$f":"IF(F23=0,\"\",IF(F23<C23,\"Atenção, observar os intervalos!\",IF(F23>E23,\"Atenção, observar os intervalos!\",\"\")))","v":""},"DF",5.8999999999999999E-3]
[null,"Despesas Financeiras",5.8999999999999999E-3,1.23E-2,1.3899999999999999E-2,5.8999999999999999E-3,{"$f":"IF(F24=0,\"\",IF(F24<C24,\"Atenção, observar os intervalos!\",IF(F24>E24,\"Atenção, observar os intervalos!\",\"\")))","v":""},"L",6.1600000000000002E-2]
[null,"Lucro",6.1600000000000002E-2,7.3999999999999996E-2,8.9599999999999999E-2,6.1600000000000002E-2,{"$f":"IF(F25=0,\"\",IF(F25<C25,\"Atenção, observar os intervalos!\",IF(F25>E25,\"Atenção, observar os intervalos!\",\"\")))","v":""},"l1",3.6499999999999998E-2]
[null,"I1: PIS e COFINS",null,null,null,3.6499999999999998E-2,null,"l2",0.03]
[null,"I2: ISSQN (conforme legislação municipal)",null,null,null,0.03,null,"l3",4.4999999999999998E-2]
[null,"I3: Cont.Prev s/Rec.Bruta (Lei 12844/13 - Desoneração)",null,null,null,4.4999999999999998E-2]
[]
[null,"BDI - SEM Desoneração da folha de pagamento",null,null,null,{"$f":"ROUND((((1+I19+I21+I22)*(1+I23)*(1+I24))/(1-I25-I26))-1,4)","v":0.19850000000000001},null,"1º QUARTIL","MÉDIO","3º QUARTIL"]
[null,"BDI - COM Desoneração da folha de pagamento",null,null,null,{"$f":"ROUND((((1+I19+I21+I22)*(1+I23)*(1+I24))/(1-I25-I26-I27))-1,4)","v":0.25919999999999999},null,0.2034,0.22120000000000001,0.25]
[]
[null,"Declaramos que esta planilha foi elaborada conforme equação para cálculo do percentual do BDI recomendada pelo Acórdão 2622/2013 - TCU, representada pela fórmula abaixo."]
[]
[null,"BDI - SEM Desoneração = [(1+AC+S+G+R)X(1+DF)X(1+L)/(1-I1-I2)]-1"]
[null,"BDI - COM Desoneração = [(1+AC+S+G+R)X(1+DF)X(1+L)/(1-I1-I2-I3)]-1"]
[]
[]
[]
[]
[]
[null,"Responsável Técnico:","MARCIO TRENTINI"]
[null,"Carimbo e Assinatura CREA/CAU:","CREA - PR 133392/D"]
[]
[]
[]
[]
[]
[]
[]
[null,"Responsavel Legal:","."]
[null,"Carimbo e Assinatura","."]

{"sheet":"P. BDI 2","index":1,"n_rows":51,"n_cols":10,"rows_kept":51,"cut":false,"hidden":false,"merged":[[35,1,35,5],[7,2,7,5],[11,3,11,5],[14,3,14,5],[18,2,18,4],[25,1,25,4],[26,1,26,4],[27,1,27,4],[29,1,29,4],[30,1,30,4],[32,1,32,5],[34,1,34,5],[8,2,8,5],[6,2,6,5],[1,1,1,5],[2,2,2,5],[3,2,3,5],[4,2,4,5],[5,2,5,5]]}
[null,"IMPRIMIR EM PAPEL TIMBRADO DA EMPRESA PROPONENTE "]
[null,"BDI - Bonificações e Despesas Indiretas"]
[null,"Edital :","TP-30/2018"]
[null,"Tomador: ","Prefeitura Municipal de Dois Vizinhos - PR"]
[null,"Empreendimento: ","PONTE SOBRE CORREGO PINZON"]
[null,"Local da Obra:","RUA JOSE CLETO COM RUA ZACARIAS DE VASCONCELOS"]
[null,"Empresa Prop.:","PREENCHER"]
[null,"CNPJ:","PREENCHER"]
[null,"Referencia:","PREENCHER"]
[]
[null,"Identifique o tipo de obra:",2,{"$f":"IF(C11>0,IF(C11<7,,\"<--- Insira valor entre 1 e 6\"),\"<--- Insira valor entre 1 e 6\")","v":0}]
[null,"Construção de edifícios:",1,"Informe a base de cálculo do ISSQN."]
[null,"Construção de rodovias e ferrovias:",2,{"$f":"IF(D14<>0,0,\"( X )\")","v":0},"Sobre os serviços."]
[null,"Construção de redes de abastecimento de água, coleta de esgoto e construções correlatas:",3,"x","Sobre a mão-de-obra."]
[null,"Construção e manutenção de estações e redes de distribuição de energia elétrica:",4,"Informe a ocorrência da DESONERAÇÃO da folha de pagamento. Lei 12844/2013."]
[null,"Obras portuárias, marítimas e fluviais:",5,{"$f":"IF(D17<>0,0,\"( X )\")","v":0},"SEM Desoneração."]
[null,"Fornecimento de materiais e equipamentos:",6,"x","COM Desoneração."]
[]
[null,null,"Intervalo de admissibilidade",null,null,null,null,"Ac",{"$f":"F21","v":"PREENCHER"}]
[null,"Item Componente do BDI","1º Quartil","Médio","3º Quartil","Valores Propostos",null,"S",{"$f":"F22","v":"PREENCHER"}]
[null,"Administração Central",3.7999999999999999E-2,4.0099999999999997E-2,4.6699999999999998E-2,"PREENCHER",{"$f":"IF(F21=0,\"\",IF(F21<C21,\"Atenção, observar os intervalos!\",IF(F21>E21,\"Atenção, observar os intervalos!\",\"\")))","v":"Atenção, observar os intervalos!"},"G",{"$f":"I20","v":"PREENCHER"}]
[null,"Seguro e Garantia",3.2000000000000002E-3,4.0000000000000001E-3,7.4000000000000003E-3,"PREENCHER",{"$f":"IF(F22=0,\"\",IF(F22<C22,\"Atenção, observar os intervalos!\",IF(F22>E22,\"Atenção, observar os intervalos!\",\"\")))","v":"Atenção, observar os intervalos!"},"R",{"$f":"F23","v":"PREENCHER"}]
[null,"Risco",5.0000000000000001E-3,5.5999999999999999E-3,9.7000000000000003E-3,"PREENCHER",{"$f":"IF(F23=0,\"\",IF(F23<C23,\"Atenção, observar os intervalos!\",IF(F23>E23,\"Atenção, observar os intervalos!\",\"\")))","v":"Atenção, observar os intervalos!"},"DF","PREENCHER"]
[null,"Despesas Financeiras",1.0200000000000001E-2,1.11E-2,1.21E-2,"PREENCHER",{"$f":"IF(F24=0,\"\",IF(F24<C24,\"Atenção, observar os intervalos!\",IF(F24>E24,\"Atenção, observar os intervalos!\",\"\")))","v":"Atenção, observar os intervalos!"},"L","PREENCHER"]
[null,"Lucro",6.6400000000000001E-2,7.2999999999999995E-2,8.6900000000000005E-2,"PREENCHER",{"$f":"IF(F25=0,\"\",IF(F25<C25,\"Atenção, observar os intervalos!\",IF(F25>E25,\"Atenção, observar os intervalos!\",\"\")))","v":"Atenção, observar os intervalos!"},"l1","PREENCHER"]
[null,"I1: PIS e COFINS",null,null,null,"PREENCHER",null,"l2","PREENCHER"]
[null,"I2: ISSQN (conforme legislação municipal)",null,null,null,"PREENCHER",null,"l3",4.4999999999999998E-2]
[null,"I3: Cont.Prev s/Rec.Bruta (Lei 12844/13 - Desoneração)",null,null,null,4.4999999999999998E-2]
[]
[null,"BDI - SEM Desoneração da folha de pagamento",null,null,null,{"$f":"ROUND((((1+I19+I21+I22)*(1+I23)*(1+I24))/(1-I25-I26))-1,4)","v":{"$error":"#VALUE!"}},null,"1º QUARTIL","MÉDIO","3º QUARTIL"]
[null,"BDI - COM Desoneração da folha de pagamento",null,null,null,{"$f":"ROUND((((1+I19+I21+I22)*(1+I23)*(1+I24))/(1-I25-I26-I27))-1,4)","v":{"$error":"#VALUE!"}},null,0.2034,0.22120000000000001,0.25]
[]
[null,"Declaramos que esta planilha foi elaborada conforme equação para cálculo do percentual do BDI recomendada pelo Acórdão 2622/2013 - TCU, representada pela fórmula abaixo."]
[]
[null,"BDI - SEM Desoneração = [(1+AC+S+G+R)X(1+DF)X(1+L)/(1-I1-I2)]-1"]
[null,"BDI - COM Desoneração = [(1+AC+S+G+R)X(1+DF)X(1+L)/(1-I1-I2-I3)]-1"]
[]
[]
[]
[]
[]
[]
[]
[null,"Responsável Técnico:","."]
[null,"Carimbo e Assinatura CREA/CAU:","."]
[]
[]
[]
[]
[null,"Responsavel Legal:","."]
[null,"Carimbo e Assinatura","CPF:"]

{"sheet":"P. BDI 3","index":2,"n_rows":51,"n_cols":10,"rows_kept":51,"cut":false,"hidden":true,"merged":[[35,1,35,5],[7,2,7,5],[11,3,11,5],[14,3,14,5],[18,2,18,4],[25,1,25,4],[26,1,26,4],[27,1,27,4],[29,1,29,4],[30,1,30,4],[32,1,32,5],[34,1,34,5],[6,2,6,5],[1,1,1,5],[2,2,2,5],[3,2,3,5],[4,2,4,5],[5,2,5,5]]}
[null,"IMPRIMIR EM PAPEL TIMBRADO DA EMPRESA PROPONENTE "]
[null,"BDI - Bonificações e Despesas Indiretas"]
[null,"Edital :","TP -xxx"]
[null,"Tomador: ","Prefeitura Municipal de Dois Vizinhos - PR"]
[null,"Empreendimento: ","DRENAGEM PLUVIAL URBANA"]
[null,"Local da Obra:",{"$f":"'P. BDI 1'!C6:F6","v":"Dois Vizinhos - Pr"}]
[null,"Empresa Prop.:","xxxxxxxxxxxxxx"]
[null,"CNPJ:","xxxxxxxxxxxxxx"]
[null,"Referencia:"]
[]
[null,"Identifique o tipo de obra:",3,{"$f":"IF(C11>0,IF(C11<7,,\"<--- Insira valor entre 1 e 6\"),\"<--- Insira valor entre 1 e 6\")","v":0}]
[null,"Construção de edifícios:",1,"Informe a base de cálculo do ISSQN."]
[null,"Construção de rodovias e ferrovias:",2,{"$f":"IF(D14<>0,0,\"( X )\")","v":0},"Sobre os serviços."]
[null,"Construção de redes de abastecimento de água, coleta de esgoto e construções correlatas:",3,"x","Sobre a mão-de-obra."]
[null,"Construção e manutenção de estações e redes de distribuição de energia elétrica:",4,"Informe a ocorrência da DESONERAÇÃO da folha de pagamento. Lei 12844/2013."]
[null,"Obras portuárias, marítimas e fluviais:",5,{"$f":"IF(D17<>0,0,\"( X )\")","v":0},"SEM Desoneração."]
[null,"Fornecimento de materiais e equipamentos:",6,"x","COM Desoneração."]
[]
[null,null,"Intervalo de admissibilidade",null,null,null,null,"Ac",{"$f":"F21","v":3.4299999999999997E-2}]
[null,"Item Componente do BDI","1º Quartil","Médio","3º Quartil","Valores Propostos",null,"S",{"$f":"F22","v":2.8E-3}]
[null,"Administração Central",3.4299999999999997E-2,4.9299999999999997E-2,6.7100000000000007E-2,3.4299999999999997E-2,{"$f":"IF(F21=0,\"\",IF(F21<C21,\"Atenção, observar os intervalos!\",IF(F21>E21,\"Atenção, observar os intervalos!\",\"\")))","v":""},"G",{"$f":"I20","v":2.8E-3}]
[null,"Seguro e Garantia",2.8E-3,4.8999999999999998E-3,7.4999999999999997E-3,2.8E-3,{"$f":"IF(F22=0,\"\",IF(F22<C22,\"Atenção, observar os intervalos!\",IF(F22>E22,\"Atenção, observar os intervalos!\",\"\")))","v":""},"R",{"$f":"F23","v":0.01}]
[null,"Risco",0.01,1.3899999999999999E-2,1.7399999999999999E-2,0.01,{"$f":"IF(F23=0,\"\",IF(F23<C23,\"Atenção, observar os intervalos!\",IF(F23>E23,\"Atenção, observar os intervalos!\",\"\")))","v":""},"DF",9.4000000000000004E-3]
[null,"Despesas Financeiras",9.4000000000000004E-3,9.9000000000000008E-3,1.17E-2,9.4000000000000004E-3,{"$f":"IF(F24=0,\"\",IF(F24<C24,\"Atenção, observar os intervalos!\",IF(F24>E24,\"Atenção, observar os intervalos!\",\"\")))","v":""},"L",6.7400000000000002E-2]
[null,"Lucro",6.7400000000000002E-2,8.0399999999999999E-2,9.4E-2,6.7400000000000002E-2,{"$f":"IF(F25=0,\"\",IF(F25<C25,\"Atenção, observar os intervalos!\",IF(F25>E25,\"Atenção, observar os intervalos!\",\"\")))","v":""},"l1",3.6499999999999998E-2]
[null,"I1: PIS e COFINS",null,null,null,3.6499999999999998E-2,null,"l2",0.03]
[null,"I2: ISSQN (conforme legislação municipal)",null,null,null,0.03,null,"l3",4.4999999999999998E-2]
[null,"I3: Cont.Prev s/Rec.Bruta (Lei 12844/13 - Desoneração)",null,null,null,4.4999999999999998E-2]
[]
[null,"BDI - SEM Desoneração da folha de pagamento",null,null,null,{"$f":"ROUND((((1+I19+I21+I22)*(1+I23)*(1+I24))/(1-I25-I26))-1,4)","v":0.20849999999999999},null,"1º QUARTIL","MÉDIO","3º QUARTIL"]
[null,"BDI - COM Desoneração da folha de pagamento",null,null,null,{"$f":"ROUND((((1+I19+I21+I22)*(1+I23)*(1+I24))/(1-I25-I26-I27))-1,4)","v":0.26979999999999998},null,0.2034,0.22120000000000001,0.25]
[]
[null,"Declaramos que esta planilha foi elaborada conforme equação para cálculo do percentual do BDI recomendada pelo Acórdão 2622/2013 - TCU, representada pela fórmula abaixo."]
[]
[null,"BDI - SEM Desoneração = [(1+AC+S+G+R)X(1+DF)X(1+L)/(1-I1-I2)]-1"]
[null,"BDI - COM Desoneração = [(1+AC+S+G+R)X(1+DF)X(1+L)/(1-I1-I2-I3)]-1"]
[]
[]
[]
[]
[null,"Responsável Técnico:",{"$f":"'P. BDI 1'!C42","v":"MARCIO TRENTINI"}]
[null,"Carimbo e Assinatura CREA/CAU:",{"$f":"'P. BDI 1'!C43","v":"CREA - PR 133392/D"}]
[]
[]
[]
[]
[]
[]
[]
[null,"Responsavel Legal:",{"$f":"'P. BDI 1'!C51","v":"."}]
[null,"Carimbo e Assinatura",{"$f":"'P. BDI 1'!C52","v":"."}]

{"sheet":"PONTE","index":3,"n_rows":76,"n_cols":8,"rows_kept":76,"cut":false,"hidden":false,"merged":[[50,0,50,6],[51,0,51,6],[9,0,9,1],[10,0,10,1],[8,0,8,1],[49,0,49,6],[11,0,11,1],[1,0,2,7],[4,0,4,1],[5,0,5,1],[6,0,6,1],[7,0,7,1]]}
["IMPRIMIR EM PAPEL TIMBRADO DA EMPRESA PROPONENTE "]
["PLANILHA ORÇAMENTARIA"]
[]
[]
[{"$f":"'P. BDI 1'!B3","v":"Edital :"},null,{"$f":"'P. BDI 2'!C3","v":"TP-30/2018"}]
[{"$f":"'P. BDI 1'!B4","v":"Tomador: "},null,{"$f":"'P. BDI 2'!C4","v":"Prefeitura Municipal de Dois Vizinhos - PR"}]
[{"$f":"'P. BDI 1'!B5","v":"Empreendimento: "},null,{"$f":"'P. BDI 2'!C5","v":"PONTE SOBRE CORREGO PINZON"}]
[{"$f":"'P. BDI 1'!B6","v":"Local da Obra:"},null,{"$f":"'P. BDI 2'!C6","v":"RUA JOSE CLETO COM RUA ZACARIAS DE VASCONCELOS"}]
[{"$f":"'P. BDI 1'!B7","v":"Empresa Prop.:"},null,{"$f":"'P. BDI 2'!C7","v":"PREENCHER"}]
[{"$f":"'P. BDI 1'!B8","v":"CNPJ:"},null,{"$f":"'P. BDI 2'!C8","v":"PREENCHER"}]
[{"$f":"'P. BDI 1'!B9","v":"Referencia:"},null,{"$f":"'P. BDI 2'!C9","v":"PREENCHER"}]
["BDI",null,{"$f":"'P. BDI 2'!F31","v":{"$error":"#VALUE!"}}]
[]
["ITEM .","REF.","DESCRIÇÃO","UN","VALOR UNIT.","QUANT.","VALOR UNIT C/ BDI","TOTAL"]
[]
[null,null,"PONTE EM CONCRETO ARMADO"]
[]
[1,null,"SERVIÇOS PRELIMINARES",null,null,null,"TOTAL DO GRUPO:",{"$f":"SUM(H19:H26)","v":{"$error":"#VALUE!"}}]
[]
["1.1","74209/001","PLACA DE OBRA  EM CHAPA GALVANIZADA ","M2",null,2.4,{"$f":"ROUND((E20*$C$12)+E20,2)","v":{"$error":"#VALUE!"}},{"$f":"ROUND(G20*F20,2)","v":{"$error":"#VALUE!"}}]
["1.2",93212,"EXECUÇÃO DE SANITARIO E VESTIARIO EM CANTEIRO DE OBRA","M2",null,10,{"$f":"ROUND((E21*$C$12)+E21,2)","v":{"$error":"#VALUE!"}},{"$f":"ROUND(G21*F21,2)","v":{"$error":"#VALUE!"}}]
["1.3",41598,"ENTRADA PROVISORIA DE ENERGIA ELETRICA AEREA TRIF. 40A EM POSTE DE MADEIRA","UND",null,1,{"$error":"#VALUE!"},{"$f":"ROUND(G22*F22,2)","v":{"$error":"#VALUE!"}}]
["1.4","DER 401020","DESMATAMENTO E LIMPEZA DIAM. ATE 30 CM","M2",null,220.43,{"$error":"#VALUE!"},{"$error":"#VALUE!"}]
["1.5","DER 411000","ESC. CARGA E TRANSP. 1A CAT. 800-1000M","M3",null,330.65,{"$error":"#VALUE!"},{"$f":"ROUND(G24*F24,2)","v":{"$error":"#VALUE!"}}]
["1.6",73686,"LOCAÇÃO DE OBRA COM USO DE EQUIP. TOPOGRAFICOS. INCLUSIVE NIVELADOR","M2",null,133.65,{"$error":"#VALUE!"},{"$f":"ROUND(G25*F25,2)","v":{"$error":"#VALUE!"}}]
[]
[2,null,"INFRAESTRUTURA DE FUNDAÇÕES (ESTACAS E BLOCOS DE FUNDAÇÃO)",null,null,null,"TOTAL DO GRUPO:",{"$f":"SUM(H28:H33)","v":{"$error":"#VALUE!"}}]
[]
["2.1",90877,"ESTACAS DE CONC. ARMADO DIAM. 25CM. PERF. TRADO MEC. CONCR. USINDADO","M",null,336,{"$f":"ROUND((E29*$C$12)+E29,2)","v":{"$error":"#VALUE!"}},{"$f":"ROUND(G29*F29,2)","v":{"$error":"#VALUE!"}}]
["2.2","DER 730000","AÇO CA-50 FORNEC. DOBR.. COLOCAÇÃO","KG",null,1915.83,{"$f":"ROUND((E30*$C$12)+E30,2)","v":{"$error":"#VALUE!"}},{"$f":"ROUND(G30*F30,2)","v":{"$error":"#VALUE!"}}]
["2.3","DER 743000","CONCRETO FCK=30MPA","M3",null,30.37,{"$error":"#VALUE!"},{"$error":"#VALUE!"}]
["2.4","DER 602000","FORMAS DE MADEIRA ","M2",null,59.42,{"$error":"#VALUE!"},{"$f":"ROUND(G32*F32,2)","v":{"$error":"#VALUE!"}}]
[]
[3,null,"MESOESTRUTURA (CABECEIRAS E ALAS)",null,null,null,"TOTAL DO GRUPO:",{"$f":"SUM(H35:H39)","v":{"$error":"#VALUE!"}}]
[]
["3.1","DER 730000","AÇO CA-50 FORNEC. DOBR.. COLOCAÇÃO","KG",{"$f":"E30","v":0},2191.83,{"$f":"ROUND((E36*$C$12)+E36,2)","v":{"$error":"#VALUE!"}},{"$f":"ROUND(G36*F36,2)","v":{"$error":"#VALUE!"}}]
["3.2","DER 743000","CONCRETO FCK=30MPA","M3",{"$f":"E31","v":0},91.11,{"$f":"ROUND((E37*$C$12)+E37,2)","v":{"$error":"#VALUE!"}},{"$error":"#VALUE!"}]
["3.3","DER 602000","FORMAS DE MADEIRA ","M2",{"$f":"E32","v":0},348.66,{"$error":"#VALUE!"},{"$error":"#VALUE!"}]
[]
[4,null,"SUPERESTRUTURA",null,null,null,"TOTAL DO GRUPO:",{"$f":"SUM(H41:H45)","v":{"$error":"#VALUE!"}}]
[]
["4.1","DER 730000","AÇO CA-50 FORNEC. DOBR.. COLOCAÇÃO","KG",null,2625,{"$f":"ROUND((E42*$C$12)+E42,2)","v":{"$error":"#VALUE!"}},{"$f":"ROUND(G42*F42,2)","v":{"$error":"#VALUE!"}}]
["4.2","DER 743000","CONCRETO FCK=30MPA","M3",null,54.85,{"$f":"ROUND((E43*$C$12)+E43,2)","v":{"$error":"#VALUE!"}},{"$error":"#VALUE!"}]
["4.3","DER 602000","FORMAS DE MADEIRA ","M2",null,154.47,{"$error":"#VALUE!"},{"$error":"#VALUE!"}]
[]
[5,null,"SERVIÇOS FINAIS",null,null,null,"TOTAL DO GRUPO:",{"$f":"SUM(H47:H49)","v":{"$error":"#VALUE!"}}]
[]
["5.1","DER 70500","ATERRO E COMPACTAÇÃO MECANICA NO ENCONTRO DA RUA COM AS CABECEIRAS","M3",null,173.7,{"$f":"ROUND((F48*$C$12)+F48,2)","v":{"$error":"#VALUE!"}},{"$f":"ROUND(G48*E48,2)","v":{"$error":"#VALUE!"}}]
[]
["VALOR TOTAL DA OBRA :",null,null,null,null,null,null,{"$f":"H52/(1+C12)","v":{"$error":"#VALUE!"}}]
["BDI :",null,null,null,null,null,null,{"$f":"H52-H50","v":{"$error":"#VALUE!"}}]
["VALOR TOTAL DA OBRA COM BDI:",null,null,null,null,null,null,{"$f":"H18+H46+H27+H34+H40","v":{"$error":"#VALUE!"}}]
[]
[]
[]
[]
[]
[]
[]
[]
[null,null,null,"Responsável Técnico:",{"$f":"'P. BDI 2'!C44","v":"."}]
[null,null,null,"Carimbo e Assinatura CREA/CAU:",{"$f":"'P. BDI 2'!C45","v":"."}]
[]
[]
[]
[]
[]
[]
[]
[]
[]
[]
[]
[]
[null,null,null,"Responsavel Legal:",{"$f":"'P. BDI 2'!C50","v":"."}]
[null,null,null,"Carimbo e Assinatura",{"$f":"'P. BDI 2'!C51","v":"CPF:"}]

{"sheet":"QCI","index":4,"n_rows":59,"n_cols":8,"rows_kept":59,"cut":false,"hidden":false,"merged":[[27,3,27,4],[27,5,27,6],[25,5,25,6],[25,3,25,4],[26,3,26,4],[26,5,26,6],[32,1,32,6],[33,1,33,6],[31,1,31,6],[28,5,28,6],[29,3,29,4],[28,3,28,4],[30,5,30,6],[30,3,30,4],[29,5,29,6],[11,0,11,1],[9,0,9,1],[10,0,10,1],[1,0,2,7],[7,0,7,1],[8,0,8,1],[12,0,12,1],[13,0,13,1],[14,0,14,1],[24,5,24,6],[24,3,24,4]]}
["IMPRIMIR EM PAPEL TIMBRADO DA EMPRESA PROPONENTE "]
["QUADRO DE COMPOSIÇÃO DE INVESTIMENTO "]
[]
[]
[]
[]
[]
[{"$f":"'P. BDI 1'!B3","v":"Edital :"},null,{"$f":"'P. BDI 2'!C3","v":"TP-30/2018"}]
[{"$f":"'P. BDI 1'!B4","v":"Tomador: "},null,{"$f":"'P. BDI 2'!C4","v":"Prefeitura Municipal de Dois Vizinhos - PR"}]
[{"$f":"'P. BDI 1'!B5","v":"Empreendimento: "},null,{"$f":"'P. BDI 2'!C5","v":"PONTE SOBRE CORREGO PINZON"}]
[{"$f":"'P. BDI 1'!B6","v":"Local da Obra:"},null,{"$f":"'P. BDI 2'!C6","v":"RUA JOSE CLETO COM RUA ZACARIAS DE VASCONCELOS"}]
[{"$f":"'P. BDI 1'!B7","v":"Empresa Prop.:"},null,{"$f":"'P. BDI 2'!C7","v":"PREENCHER"}]
[{"$f":"'P. BDI 1'!B8","v":"CNPJ:"},null,{"$f":"'P. BDI 2'!C8","v":"PREENCHER"}]
[{"$f":"'P. BDI 1'!B9","v":"Referencia:"},null,{"$f":"'P. BDI 2'!C9","v":"PREENCHER"}]
[]
[]
[]
[]
[]
[]
[]
[]
[]
[]
[null,"LOTE","DESCRIÇÃO ","% DO GRUPO",null,"VALOR DO GRUPO:",null,"TOTAL ACUM."]
[null,{"$f":"PONTE!A18","v":1},{"$f":"PONTE!C18","v":"SERVIÇOS PRELIMINARES"},{"$f":"F26/$H$34","v":{"$error":"#VALUE!"}},null,{"$f":"PONTE!H18","v":{"$error":"#VALUE!"}},null,{"$f":"F26","v":{"$error":"#VALUE!"}}]
[null,{"$f":"PONTE!A27","v":2},{"$f":"PONTE!C27","v":"INFRAESTRUTURA DE FUNDAÇÕES (ESTACAS E BLOCOS DE FUNDAÇÃO)"},{"$f":"F27/$H$34","v":{"$error":"#VALUE!"}},null,{"$f":"PONTE!H27","v":{"$error":"#VALUE!"}},null,{"$f":"H26+F27","v":{"$error":"#VALUE!"}}]
[null,{"$f":"PONTE!A34","v":3},{"$f":"PONTE!C34","v":"MESOESTRUTURA (CABECEIRAS E ALAS)"},{"$error":"#VALUE!"},null,{"$f":"PONTE!H34","v":{"$error":"#VALUE!"}},null,{"$f":"H27+F28","v":{"$error":"#VALUE!"}}]
[null,{"$f":"PONTE!A40","v":4},{"$f":"PONTE!C40","v":"SUPERESTRUTURA"},{"$error":"#VALUE!"},null,{"$f":"PONTE!H40","v":{"$error":"#VALUE!"}},null,{"$error":"#VALUE!"}]
[null,{"$f":"PONTE!A46","v":5},{"$f":"PONTE!C46","v":"SERVIÇOS FINAIS"},{"$error":"#VALUE!"},null,{"$f":"PONTE!H46","v":{"$error":"#VALUE!"}},null,{"$error":"#VALUE!"}]
[]
[null,"VALOR TOTAL DA OBRA :",null,null,null,null,null,{"$f":"PONTE!H50","v":{"$error":"#VALUE!"}}]
[null,"BDI :",null,null,null,null,null,{"$f":"PONTE!H51","v":{"$error":"#VALUE!"}}]
[null,"VALOR TOTAL DA OBRA COM BDI:",null,null,null,null,null,{"$f":"PONTE!H52","v":{"$error":"#VALUE!"}}]
[]
[]
[]
[]
[]
[]
[]
[]
[]
[]
[]
[null,null,null,"Responsável Técnico:",{"$f":"'P. BDI 2'!C44","v":"."}]
[null,null,null,"Carimbo e Assinatura CREA/CAU:",{"$f":"'P. BDI 2'!C45","v":"."}]
[]
[]
[]
[]
[]
[]
[]
[]
[]
[]
[null,null,null,{"$f":"PONTE!D75","v":"Responsavel Legal:"},{"$f":"'P. BDI 2'!C50","v":"."}]
[null,null,null,{"$f":"PONTE!D76","v":"Carimbo e Assinatura"},{"$f":"'P. BDI 2'!C51","v":"CPF:"}]

{"sheet":"CRON","index":5,"n_rows":47,"n_cols":13,"rows_kept":47,"cut":false,"hidden":false,"merged":[[18,4,18,5],[19,4,19,5],[20,4,20,5],[17,4,17,5],[16,2,16,3],[18,2,18,3],[19,2,19,3],[20,2,20,3],[17,2,17,3],[21,1,21,3],[21,4,21,5],[1,0,2,12],[10,0,10,1],[11,0,11,1],[7,0,7,1],[9,0,9,1],[4,0,4,1],[5,0,5,1],[6,0,6,1],[8,0,8,1],[14,2,14,3],[14,4,14,5],[16,4,16,5],[15,4,15,5],[15,2,15,3]]}
["IMPRIMIR EM PAPEL TIMBRADO DA EMPRESA PROPONENTE "]
["CRONOGRAMA FÍSICO-FINANCEIRO "]
[]
[]
[{"$f":"'P. BDI 1'!B3","v":"Edital :"},null,{"$f":"'P. BDI 2'!C3","v":"TP-30/2018"}]
[{"$f":"'P. BDI 1'!B4","v":"Tomador: "},null,{"$f":"'P. BDI 2'!C4","v":"Prefeitura Municipal de Dois Vizinhos - PR"}]
[{"$f":"'P. BDI 1'!B5","v":"Empreendimento: "},null,{"$f":"'P. BDI 2'!C5","v":"PONTE SOBRE CORREGO PINZON"}]
[{"$f":"'P. BDI 1'!B6","v":"Local da Obra:"},null,{"$f":"'P. BDI 2'!C6","v":"RUA JOSE CLETO COM RUA ZACARIAS DE VASCONCELOS"}]
[{"$f":"'P. BDI 1'!B7","v":"Empresa Prop.:"},null,{"$f":"'P. BDI 2'!C7","v":"PREENCHER"}]
[{"$f":"'P. BDI 1'!B8","v":"CNPJ:"},null,{"$f":"'P. BDI 2'!C8","v":"PREENCHER"}]
[{"$f":"'P. BDI 1'!B9","v":"Referencia:"},null,{"$f":"'P. BDI 2'!C9","v":"PREENCHER"}]
[]
[]
[]
[null,"LOTE","DESCRIÇÃO ",null,"VALOR DO GRUPO",null,"MÊS °1","MÊS °2","MÊS °3","MÊS °4","MÊS °5","MÊS °6","% TOTAL"]
[null,{"$f":"QCI!B26","v":1},{"$f":"QCI!C26","v":"SERVIÇOS PRELIMINARES"},null,{"$f":"QCI!F26","v":{"$error":"#VALUE!"}},null,1,null,null,null,null,null,{"$f":"SUM(G16:L16)","v":1}]
[null,{"$f":"QCI!B27","v":2},{"$f":"QCI!C27","v":"INFRAESTRUTURA DE FUNDAÇÕES (ESTACAS E BLOCOS DE FUNDAÇÃO)"},null,{"$f":"QCI!F27","v":{"$error":"#VALUE!"}},null,null,0.5,0.5,null,null,null,{"$f":"SUM(G17:L17)","v":1}]
[null,{"$f":"QCI!B28","v":3},{"$f":"QCI!C28","v":"MESOESTRUTURA (CABECEIRAS E ALAS)"},null,{"$f":"QCI!F28","v":{"$error":"#VALUE!"}},null,null,null,0.2,0.6,0.2,null,1]
[null,{"$f":"QCI!B29","v":4},{"$f":"QCI!C29","v":"SUPERESTRUTURA"},null,{"$f":"QCI!F29","v":{"$error":"#VALUE!"}},null,null,null,null,null,0.3,0.7,1]
[null,{"$f":"QCI!B30","v":5},{"$f":"QCI!C30","v":"SERVIÇOS FINAIS"},null,{"$f":"QCI!F30","v":{"$error":"#VALUE!"}},null,null,null,null,null,null,1,1]
[]
[null,"TOTAL:",null,null,{"$f":"SUM(E16:F21)","v":{"$error":"#VALUE!"}},null,{"$f":"G17*E17+G16*E16+G19*E19+G20*E20+G21*E21","v":{"$error":"#VALUE!"}},{"$f":"H17*E17+H16*E16+H19*E19+H20*E20+H21*E21","v":{"$error":"#VALUE!"}},{"$f":"I17*E17+I16*E16+I19*E19+I20*E20+I18*E18","v":{"$error":"#VALUE!"}},{"$f":"J17*E17+J16*E16+J19*E19+J20*E20+J18*E18","v":{"$error":"#VALUE!"}},{"$f":"K17*E17+K16*E16+K19*E19+K20*E20+K18*E18","v":{"$error":"#VALUE!"}},{"$f":"L17*E17+L16*E16+L19*E19+L20*E20+L18*E18","v":{"$error":"#VALUE!"}},{"$f":"SUM(G22:L22)","v":{"$error":"#VALUE!"}}]
[]
[]
[]
[]
[]
[]
[]
[]
[]
[]
[null,null,null,null,null,"Responsável Técnico:",{"$f":"'P. BDI 2'!C44","v":"."}]
[null,null,null,null,null,"Carimbo e Assinatura CREA/CAU:",{"$f":"'P. BDI 2'!C45","v":"."}]
[]
[]
[]
[]
[]
[]
[]
[]
[]
[]
[]
[null,null,null,null,null,"Responsavel Legal:",{"$f":"'P. BDI 2'!C50","v":"."}]
[null,null,null,null,null,"Carimbo e Assinatura",{"$f":"'P. BDI 2'!C51","v":"CPF:"}]