{"text_format":"1","workbook":"xlsx","n_sheets":10,"sheets":["P. BDI 1","P. BDI 2","P. BDI 3","Kennedy e Hablich","EXCLUIR","QCI","CRON","Comp.","composicao","CRONO MORADIAS 08-08-07"],"not_rendered":{"charts":0,"images":0,"macros":1,"external_links":3,"defined_names":62,"comments":3,"pivot_tables":0},"unopened":[],"bounds":{"document_bytes":16777216,"sheet_cells":100000,"rows_first":2000,"rows_last":500,"rows_between":2000,"halvings":0,"cell_chars":16384,"cell_head_chars":4096},"cells_cut":0,"cells_raw":0,"read":"whole","date_system":"1900"}

{"sheet":"P. BDI 1","index":0,"n_rows":52,"n_cols":10,"rows_kept":52,"cut":false,"hidden":false,"merged":[[1,1,1,5],[2,2,2,5],[3,2,3,5],[4,2,4,5],[5,2,5,5],[11,3,11,5],[6,2,6,5],[7,2,7,5],[30,1,30,4],[32,1,32,5],[8,2,8,5],[34,1,34,5],[35,1,35,5],[14,3,14,5],[18,2,18,4],[25,1,25,4],[26,1,26,4],[27,1,27,4],[29,1,29,4]]}
[null,"IMPRIMIR EM PAPEL TIMBRADO DA EMPRESA PROPONENTE "]
[null,"BDI - Bonificações e Despesas Indiretas"]
[null,"Edital :","TP- 002/2019"]
[null,"Tomador: ","Prefeitura Municipal de Dois Vizinhos - PR"]
[null,"Empreendimento: ","Reforma e revitalização de vias urbanas"]
[null,"Local da Obra:","Dois Vizinhos - Pr"]
[null,"Empresa Prop.:","xxxxxxxxxxxxxx"]
[null,"CNPJ:","xxxxxxxxxxxxxx"]
[null,"Referencia:","xxxxxxxxxxxxxx"]
[]
[null,"Identifique o tipo de obra:",1,{"$f":"IF(C11>0,IF(C11<7,,\"<--- Insira valor entre 1 e 6\"),\"<--- Insira valor entre 1 e 6\")","v":0}]
[null,"Construção de edifícios:",1,"Informe a base de cálculo do ISSQN."]
[null,"Construção de rodovias e ferrovias:",2,{"$f":"IF(D14<>0,0,\"( X )\")","v":0},"Sobre os serviços."]
[null,"Construção de redes de abastecimento de água, coleta de esgoto e construções correlatas:",3,"x","Sobre a mão-de-obra."]
[null,"Construção e manutenção de estações e redes de distribuição de energia elétrica:",4,"Informe a ocorrência da DESONERAÇÃO da folha de pagamento. Lei 12844/2013."]
[null,"Obras portuárias, marítimas e fluviais:",5,{"$f":"IF(D17<>0,0,\"( X )\")","v":0},"SEM Desoneração."]
[null,"Fornecimento de materiais e equipamentos:",6,"x","COM Desoneração."]
[]
[null,null,"Intervalo de admissibilidade",null,null,null,null,"Ac",{"$f":"F21","v":"preencher"}]
[null,"Item Componente do BDI","1º Quartil","Médio","3º Quartil","Valores Propostos",null,"S",{"$f":"F22","v":"preencher"}]
[null,"Administração Central",0.03,0.04,5.5E-2,"preencher",{"$f":"IF(F21=0,\"\",IF(F21<C21,\"Atenção, observar os intervalos!\",IF(F21>E21,\"Atenção, observar os intervalos!\",\"\")))","v":"Atenção, observar os intervalos!"},"G",{"$f":"I20","v":"preencher"}]
[null,"Seguro e Garantia",8.0000000000000002E-3,8.0000000000000002E-3,0.01,"preencher",{"$f":"IF(F22=0,\"\",IF(F22<C22,\"Atenção, observar os intervalos!\",IF(F22>E22,\"Atenção, observar os intervalos!\",\"\")))","v":"Atenção, observar os intervalos!"},"R",{"$f":"F23","v":"preencher"}]
[null,"Risco",9.7000000000000003E-3,1.2699999999999999E-2,1.2699999999999999E-2,"preencher",{"$f":"IF(F23=0,\"\",IF(F23<C23,\"Atenção, observar os intervalos!\",IF(F23>E23,\"Atenção, observar os intervalos!\",\"\")))","v":"Atenção, observar os intervalos!"},"DF","preencher"]
[null,"Despesas Financeiras",5.8999999999999999E-3,1.23E-2,1.3899999999999999E-2,"preencher",{"$f":"IF(F24=0,\"\",IF(F24<C24,\"Atenção, observar os intervalos!\",IF(F24>E24,\"Atenção, observar os intervalos!\",\"\")))","v":"Atenção, observar os intervalos!"},"L","preencher"]
[null,"Lucro",6.1600000000000002E-2,7.3999999999999996E-2,8.9599999999999999E-2,"preencher",{"$f":"IF(F25=0,\"\",IF(F25<C25,\"Atenção, observar os intervalos!\",IF(F25>E25,\"Atenção, observar os intervalos!\",\"\")))","v":"Atenção, observar os intervalos!"},"l1","preencher"]
[null,"I1: PIS e COFINS",null,null,null,"preencher",null,"l2","preencher"]
[null,"I2: ISSQN (conforme legislação municipal)",null,null,null,"preencher",null,"l3",4.4999999999999998E-2]
[null,"I3: Cont.Prev s/Rec.Bruta (Lei 12844/13 - Desoneração)",null,null,null,4.4999999999999998E-2]
[]
[null,"BDI - SEM Desoneração da folha de pagamento",null,null,null,{"$f":"ROUND((((1+I19+I21+I22)*(1+I23)*(1+I24))/(1-I25-I26))-1,4)","v":{"$error":"#VALUE!"}},null,"1º QUARTIL","MÉDIO","3º QUARTIL"]
[null,"BDI - COM Desoneração da folha de pagamento",null,null,null,{"$f":"ROUND((((1+I19+I21+I22)*(1+I23)*(1+I24))/(1-I25-I26-I27))-1,4)","v":{"$error":"#VALUE!"}},null,0.2034,0.22120000000000001,0.25]
[]
[null,"Declaramos que esta planilha foi elaborada conforme equação para cálculo do percentual do BDI recomendada pelo Acórdão 2622/2013 - TCU, representada pela fórmula abaixo."]
[]
[null,"BDI - SEM Desoneração = [(1+AC+S+G+R)X(1+DF)X(1+L)/(1-I1-I2)]-1"]
[null,"BDI - COM Desoneração = [(1+AC+S+G+R)X(1+DF)X(1+L)/(1-I1-I2-I3)]-1"]
[]
[]
[]
[]
[]
[null,"Responsável Técnico:","."]
[null,"Carimbo e Assinatura CREA/CAU:","."]
[]
[]
[]
[]
[]
[]
[]
[null,"Responsavel Legal:","."]
[null,"Carimbo e Assinatura","Cpf:"]

{"sheet":"P. BDI 2","index":1,"n_rows":52,"n_cols":10,"rows_kept":52,"cut":false,"hidden":false,"merged":[[6,2,6,5],[1,1,1,5],[2,2,2,5],[3,2,3,5],[4,2,4,5],[5,2,5,5],[35,1,35,5],[7,2,7,5],[11,3,11,5],[14,3,14,5],[18,2,18,4],[25,1,25,4],[26,1,26,4],[27,1,27,4],[29,1,29,4],[30,1,30,4],[32,1,32,5],[34,1,34,5],[8,2,8,5]]}
[null,"IMPRIMIR EM PAPEL TIMBRADO DA EMPRESA PROPONENTE "]
[null,"BDI - Bonificações e Despesas Indiretas"]
[null,"Edital :",{"$f":"'P. BDI 1'!C3","v":"TP- 002/2019"}]
[null,"Tomador: ",{"$f":"'P. BDI 1'!C4","v":"Prefeitura Municipal de Dois Vizinhos - PR"}]
[null,"Empreendimento: ",{"$f":"'P. BDI 1'!C5","v":"Reforma e revitalização de vias urbanas"}]
[null,"Local da Obra:",{"$f":"'P. BDI 1'!C6","v":"Dois Vizinhos - Pr"}]
[null,"Empresa Prop.:",{"$f":"'P. BDI 1'!C7","v":"xxxxxxxxxxxxxx"}]
[null,"CNPJ:",{"$f":"'P. BDI 1'!C8","v":"xxxxxxxxxxxxxx"}]
[null,"Referencia:",{"$f":"'P. BDI 1'!C9","v":"xxxxxxxxxxxxxx"}]
[]
[null,"Identifique o tipo de obra:",2,{"$f":"IF(C11>0,IF(C11<7,,\"<--- Insira valor entre 1 e 6\"),\"<--- Insira valor entre 1 e 6\")","v":0}]
[null,"Construção de edifícios:",1,"Informe a base de cálculo do ISSQN."]
[null,"Construção de rodovias e ferrovias:",2,{"$f":"IF(D14<>0,0,\"( X )\")","v":0},"Sobre os serviços."]
[null,"Construção de redes de abastecimento de água, coleta de esgoto e construções correlatas:",3,"x","Sobre a mão-de-obra."]
[null,"Construção e manutenção de estações e redes de distribuição de energia elétrica:",4,"Informe a ocorrência da DESONERAÇÃO da folha de pagamento. Lei 12844/2013."]
[null,"Obras portuárias, marítimas e fluviais:",5,{"$f":"IF(D17<>0,0,\"( X )\")","v":0},"SEM Desoneração."]
[null,"Fornecimento de materiais e equipamentos:",6,"x","COM Desoneração."]
[]
[null,null,"Intervalo de admissibilidade",null,null,null,null,"Ac",{"$f":"F21","v":"preencher"}]
[null,"Item Componente do BDI","1º Quartil","Médio","3º Quartil","Valores Propostos",null,"S",{"$f":"F22","v":"preencher"}]
[null,"Administração Central",3.7999999999999999E-2,4.0099999999999997E-2,4.6699999999999998E-2,"preencher",{"$f":"IF(F21=0,\"\",IF(F21<C21,\"Atenção, observar os intervalos!\",IF(F21>E21,\"Atenção, observar os intervalos!\",\"\")))","v":"Atenção, observar os intervalos!"},"G",{"$f":"I20","v":"preencher"}]
[null,"Seguro e Garantia",3.2000000000000002E-3,4.0000000000000001E-3,7.4000000000000003E-3,"preencher",{"$f":"IF(F22=0,\"\",IF(F22<C22,\"Atenção, observar os intervalos!\",IF(F22>E22,\"Atenção, observar os intervalos!\",\"\")))","v":"Atenção, observar os intervalos!"},"R",{"$f":"F23","v":"preencher"}]
[null,"Risco",5.0000000000000001E-3,5.5999999999999999E-3,9.7000000000000003E-3,"preencher",{"$f":"IF(F23=0,\"\",IF(F23<C23,\"Atenção, observar os intervalos!\",IF(F23>E23,\"Atenção, observar os intervalos!\",\"\")))","v":"Atenção, observar os intervalos!"},"DF","preencher"]
[null,"Despesas Financeiras",1.0200000000000001E-2,1.11E-2,1.21E-2,"preencher",{"$f":"IF(F24=0,\"\",IF(F24<C24,\"Atenção, observar os intervalos!\",IF(F24>E24,\"Atenção, observar os intervalos!\",\"\")))","v":"Atenção, observar os intervalos!"},"L","preencher"]
[null,"Lucro",6.6400000000000001E-2,7.2999999999999995E-2,8.6900000000000005E-2,"preencher",{"$f":"IF(F25=0,\"\",IF(F25<C25,\"Atenção, observar os intervalos!\",IF(F25>E25,\"Atenção, observar os intervalos!\",\"\")))","v":"Atenção, observar os intervalos!"},"l1","preencher"]
[null,"I1: PIS e COFINS",null,null,null,"preencher",null,"l2","preencher"]
[null,"I2: ISSQN (conforme legislação municipal)",null,null,null,"preencher",null,"l3",4.4999999999999998E-2]
[null,"I3: Cont.Prev s/Rec.Bruta (Lei 12844/13 - Desoneração)",null,null,null,4.4999999999999998E-2]
[]
[null,"BDI - SEM Desoneração da folha de pagamento",null,null,null,{"$f":"ROUND((((1+I19+I21+I22)*(1+I23)*(1+I24))/(1-I25-I26))-1,4)","v":{"$error":"#VALUE!"}},null,"1º QUARTIL","MÉDIO","3º QUARTIL"]
[null,"BDI - COM Desoneração da folha de pagamento",null,null,null,{"$f":"ROUND((((1+I19+I21+I22)*(1+I23)*(1+I24))/(1-I25-I26-I27))-1,4)","v":{"$error":"#VALUE!"}},null,0.2034,0.22120000000000001,0.25]
[]
[null,"Declaramos que esta planilha foi elaborada conforme equação para cálculo do percentual do BDI recomendada pelo Acórdão 2622/2013 - TCU, representada pela fórmula abaixo."]
[]
[null,"BDI - SEM Desoneração = [(1+AC+S+G+R)X(1+DF)X(1+L)/(1-I1-I2)]-1"]
[null,"BDI - COM Desoneração = [(1+AC+S+G+R)X(1+DF)X(1+L)/(1-I1-I2-I3)]-1"]
[]
[]
[]
[]
[]
[null,"Responsável Técnico:",{"$f":"'P. BDI 1'!C42","v":"."}]
[null,"Carimbo e Assinatura CREA/CAU:",{"$f":"'P. BDI 1'!C43","v":"."}]
[]
[]
[]
[]
[]
[]
[]
[null,"Responsavel Legal:",{"$f":"'P. BDI 1'!C51","v":"."}]
[null,"Carimbo e Assinatura",{"$f":"'P. BDI 1'!C52","v":"Cpf:"}]

{"sheet":"P. BDI 3","index":2,"n_rows":51,"n_cols":10,"rows_kept":51,"cut":false,"hidden":false,"merged":[[6,2,6,5],[1,1,1,5],[2,2,2,5],[3,2,3,5],[4,2,4,5],[5,2,5,5],[35,1,35,5],[7,2,7,5],[11,3,11,5],[14,3,14,5],[18,2,18,4],[25,1,25,4],[26,1,26,4],[27,1,27,4],[29,1,29,4],[30,1,30,4],[32,1,32,5],[34,1,34,5],[8,2,8,5]]}
[null,"IMPRIMIR EM PAPEL TIMBRADO DA EMPRESA PROPONENTE "]
[null,"BDI - Bonificações e Despesas Indiretas"]
[null,"Edital :",{"$f":"'P. BDI 1'!C3","v":"TP- 002/2019"}]
[null,"Tomador: ",{"$f":"'P. BDI 1'!C4","v":"Prefeitura Municipal de Dois Vizinhos - PR"}]
[null,"Empreendimento: ",{"$f":"'P. BDI 1'!C5","v":"Reforma e revitalização de vias urbanas"}]
[null,"Local da Obra:",{"$f":"'P. BDI 1'!C6","v":"Dois Vizinhos - Pr"}]
[null,"Empresa Prop.:",{"$f":"'P. BDI 1'!C7","v":"xxxxxxxxxxxxxx"}]
[null,"CNPJ:",{"$f":"'P. BDI 1'!C8","v":"xxxxxxxxxxxxxx"}]
[null,"Referencia:",{"$f":"'P. BDI 1'!C9","v":"xxxxxxxxxxxxxx"}]
[]
[null,"Identifique o tipo de obra:",3,{"$f":"IF(C11>0,IF(C11<7,,\"<--- Insira valor entre 1 e 6\"),\"<--- Insira valor entre 1 e 6\")","v":0}]
[null,"Construção de edifícios:",1,"Informe a base de cálculo do ISSQN."]
[null,"Construção de rodovias e ferrovias:",2,{"$f":"IF(D14<>0,0,\"( X )\")","v":0},"Sobre os serviços."]
[null,"Construção de redes de abastecimento de água, coleta de esgoto e construções correlatas:",3,"x","Sobre a mão-de-obra."]
[null,"Construção e manutenção de estações e redes de distribuição de energia elétrica:",4,"Informe a ocorrência da DESONERAÇÃO da folha de pagamento. Lei 12844/2013."]
[null,"Obras portuárias, marítimas e fluviais:",5,{"$f":"IF(D17<>0,0,\"( X )\")","v":0},"SEM Desoneração."]
[null,"Fornecimento de materiais e equipamentos:",6,"x","COM Desoneração."]
[]
[null,null,"Intervalo de admissibilidade",null,null,null,null,"Ac",{"$f":"F21","v":"preencher"}]
[null,"Item Componente do BDI","1º Quartil","Médio","3º Quartil","Valores Propostos",null,"S",{"$f":"F22","v":"preencher"}]
[null,"Administração Central",3.4299999999999997E-2,4.9299999999999997E-2,6.7100000000000007E-2,"preencher",{"$f":"IF(F21=0,\"\",IF(F21<C21,\"Atenção, observar os intervalos!\",IF(F21>E21,\"Atenção, observar os intervalos!\",\"\")))","v":"Atenção, observar os intervalos!"},"G",{"$f":"I20","v":"preencher"}]
[null,"Seguro e Garantia",2.8E-3,4.8999999999999998E-3,7.4999999999999997E-3,"preencher",{"$f":"IF(F22=0,\"\",IF(F22<C22,\"Atenção, observar os intervalos!\",IF(F22>E22,\"Atenção, observar os intervalos!\",\"\")))","v":"Atenção, observar os intervalos!"},"R",{"$f":"F23","v":"preencher"}]
[null,"Risco",0.01,1.3899999999999999E-2,1.7399999999999999E-2,"preencher",{"$f":"IF(F23=0,\"\",IF(F23<C23,\"Atenção, observar os intervalos!\",IF(F23>E23,\"Atenção, observar os intervalos!\",\"\")))","v":"Atenção, observar os intervalos!"},"DF","preencher"]
[null,"Despesas Financeiras",9.4000000000000004E-3,9.9000000000000008E-3,1.17E-2,"preencher",{"$f":"IF(F24=0,\"\",IF(F24<C24,\"Atenção, observar os intervalos!\",IF(F24>E24,\"Atenção, observar os intervalos!\",\"\")))","v":"Atenção, observar os intervalos!"},"L","preencher"]
[null,"Lucro",6.7400000000000002E-2,8.0399999999999999E-2,9.4E-2,"preencher",{"$f":"IF(F25=0,\"\",IF(F25<C25,\"Atenção, observar os intervalos!\",IF(F25>E25,\"Atenção, observar os intervalos!\",\"\")))","v":"Atenção, observar os intervalos!"},"l1","preencher"]
[null,"I1: PIS e COFINS",null,null,null,"preencher",null,"l2","preencher"]
[null,"I2: ISSQN (conforme legislação municipal)",null,null,null,"preencher",null,"l3",4.4999999999999998E-2]
[null,"I3: Cont.Prev s/Rec.Bruta (Lei 12844/13 - Desoneração)",null,null,null,4.4999999999999998E-2]
[]
[null,"BDI - SEM Desoneração da folha de pagamento",null,null,null,{"$f":"ROUND((((1+I19+I21+I22)*(1+I23)*(1+I24))/(1-I25-I26))-1,4)","v":{"$error":"#VALUE!"}},null,"1º QUARTIL","MÉDIO","3º QUARTIL"]
[null,"BDI - COM Desoneração da folha de pagamento",null,null,null,{"$f":"ROUND((((1+I19+I21+I22)*(1+I23)*(1+I24))/(1-I25-I26-I27))-1,4)","v":{"$error":"#VALUE!"}},null,0.2034,0.22120000000000001,0.25]
[]
[null,"Declaramos que esta planilha foi elaborada conforme equação para cálculo do percentual do BDI recomendada pelo Acórdão 2622/2013 - TCU, representada pela fórmula abaixo."]
[]
[null,"BDI - SEM Desoneração = [(1+AC+S+G+R)X(1+DF)X(1+L)/(1-I1-I2)]-1"]
[null,"BDI - COM Desoneração = [(1+AC+S+G+R)X(1+DF)X(1+L)/(1-I1-I2-I3)]-1"]
[]
[]
[]
[]
[null,"Responsável Técnico:",{"$f":"'P. BDI 1'!C42","v":"."}]
[null,"Carimbo e Assinatura CREA/CAU:",{"$f":"'P. BDI 1'!C43","v":"."}]
[]
[]
[]
[]
[]
[]
[]
[null,"Responsavel Legal:",{"$f":"'P. BDI 1'!C51","v":"."}]
[null,"Carimbo e Assinatura",{"$f":"'P. BDI 1'!C52","v":"Cpf:"}]

{"sheet":"Kennedy e Hablich","index":3,"n_rows":123,"n_cols":10,"rows_kept":123,"cut":false,"hidden":false,"merged":[[1,0,2,7],[4,0,4,1],[5,0,5,1],[6,0,6,1],[7,0,7,1],[4,3,4,4],[5,3,5,4],[4,5,4,6],[5,5,5,6],[97,0,97,6],[8,4,8,7],[98,0,98,6],[9,0,9,1],[10,0,10,1],[8,0,8,1],[96,0,96,6],[11,0,11,1],[10,4,10,5]]}
["IMPRIMIR EM PAPEL TIMBRADO DA EMPRESA PROPONENTE "]
["PLANILHA ORÇAMENTARIA"]
[]
[]
[{"$f":"'P. BDI 1'!B3","v":"Edital :"},null,{"$f":"'P. BDI 1'!C3:F3","v":"TP- 002/2019"},"Área:",null,{"$f":"F31+F70+F72","v":1038.5999999999999},null,"m²"]
[{"$f":"'P. BDI 1'!B4","v":"Tomador: "},null,{"$f":"'P. BDI 1'!C4:F4","v":"Prefeitura Municipal de Dois Vizinhos - PR"},"Custo R$/m2",null,{"$f":"H99/F5","v":{"$error":"#VALUE!"}}]
[{"$f":"'P. BDI 1'!B5","v":"Empreendimento: "},null,{"$f":"'P. BDI 1'!C5:F5","v":"Reforma e revitalização de vias urbanas"}]
[{"$f":"'P. BDI 1'!B6","v":"Local da Obra:"},null,"Av. Presidente Kennedy e Rua Firmo Hablich"]
[{"$f":"'P. BDI 1'!B7","v":"Empresa Prop.:"},null,{"$f":"'P. BDI 1'!C7:F7","v":"xxxxxxxxxxxxxx"}]
[{"$f":"'P. BDI 1'!B8","v":"CNPJ:"},null,{"$f":"'P. BDI 1'!C8:F8","v":"xxxxxxxxxxxxxx"}]
[{"$f":"'P. BDI 1'!B9","v":"Referencia:"},null,{"$f":"'P. BDI 1'!C9:F9","v":"xxxxxxxxxxxxxx"}]
[]
[]
["ITEM .","REF.","DESCRIÇÃO","UN","VALOR UNIT.","QUANT.","VALOR UNIT C/ BDI","TOTAL"]
[]
[null,null,"AVENIDA PRESIDENTE KENNEDY",null,null,null,"TOTAL:",{"$f":"H18+H25+H36+H46+H54","v":{"$error":"#VALUE!"}}]
[null,null,null,null,null,null,null,null,null,{"$f":"ROUND(E17*F17,2)","v":0}]
[1,null,"SERVIÇOS PRELIMINARES","BDI",{"$f":"E25","v":{"$error":"#VALUE!"}},null,"TOTAL DO GRUPO:",{"$f":"SUM(H19:H24)","v":{"$error":"#VALUE!"}}]
[]
["1.1","74209/001","PLACA DE OBRA (PARA CONSTRUCAO CIVIL) EM CHAPA GALVANIZADA *N. 22*, DE *2,0 X 1,125* M","M2",null,2.25,{"$f":"ROUND((E20*$E$18)+E20,2)","v":{"$error":"#VALUE!"}},{"$f":"ROUND(G20*F20,2)","v":{"$error":"#VALUE!"}},null,{"$f":"ROUND(E20*F20,2)","v":0}]
["1.2","97627","DEMOLIÇÃO DE PILARES (POSTES) EM CONCRETO ARMADO, DE FORMA MECANIZADA COM MARTELETE, SEM REAPROVEITAMENTO. ","M3",null,{"$f":"ROUND(5*0.35*0.35*2.5,2)","v":1.53},{"$f":"ROUND((E21*$E$18)+E21,2)","v":{"$error":"#VALUE!"}},{"$f":"ROUND(G21*F21,2)","v":{"$error":"#VALUE!"}},null,{"$f":"ROUND(E21*F21,2)","v":0}]
["1.3",97636,"DEMOLIÇÃO PARCIAL DE PAVIMENTO ASFÁLTICO, DE FORMA MECANIZADA, SEM REAPROVEITAMENTO. AF_12/2017","M2",null,{"$f":"8.5+14+4.6+6.15+12+6.7+22.8+13.85","v":88.6},{"$f":"ROUND((E22*$E$18)+E22,2)","v":{"$error":"#VALUE!"}},{"$f":"ROUND(G22*F22,2)","v":{"$error":"#VALUE!"}},null,0]
["1.4",95875,"TRANSPORTE COM CAMINHÃO BASCULANTE DE 10 M3, EM VIA URBANA PAVIMENTADA","M3XKM",null,{"$f":"F22*0.2*8","v":141.76},{"$f":"ROUND((E23*$E$18)+E23,2)","v":{"$error":"#VALUE!"}},{"$error":"#VALUE!"},null,0]
[null,null,null,null,null,null,null,null,null,0]
[2,null,"PAVIMENTAÇÃO","BDI",{"$f":"'P. BDI 2'!F31","v":{"$error":"#VALUE!"}},null,"TOTAL DO GRUPO:",{"$f":"SUM(H26:H35)","v":{"$error":"#VALUE!"}},null,{"$error":"#VALUE!"}]
[null,null,null,null,null,null,null,null,null,0]
["2.1",90100,"ESCAVAÇÃO MECANIZADA COM RETROESCAVADEIRA","M3",null,{"$f":"F30+F29","v":44.8},{"$f":"ROUND((E27*$E$25)+E27,2)","v":{"$error":"#VALUE!"}},{"$f":"ROUND(G27*F27,2)","v":{"$error":"#VALUE!"}},null,0]
["2.2",72961,"REGULARIZACAO E COMPACTACAO DE SUBLEITO","M2",null,{"$f":"F31","v":108.6},{"$f":"ROUND((E28*$E$25)+E28,2)","v":{"$error":"#VALUE!"}},{"$f":"ROUND(G28*F28,2)","v":{"$error":"#VALUE!"}},null,0]
["2.3",96400,"EXECUÇÃO E COMPACTAÇÃO DE BASE E OU SUB BASE COM MACADAME SECO/RACHÃO","M3",null,{"$f":"(F22+9)*0.25+(12*0.8*0.3)","v":27.279999999999998},{"$error":"#VALUE!"},{"$error":"#VALUE!"},null,0]
["2.4",96396,"EXECUÇÃO E COMPACTAÇÃO DE BASE E OU SUB BASE COM BRITA GRADUADA SIMPLES","M3",null,{"$f":"(F22+9)*0.15+(12*0.8*0.3)","v":17.52},{"$error":"#VALUE!"},{"$f":"ROUND(G30*F30,2)","v":{"$error":"#VALUE!"}},null,0]
["2.5",96401,"EXECUÇÃO DE IMPRIMAÇÃO COM ASFALTO DILUÍDO CM-30. AF_09/2017","M2",null,{"$f":"F22+20","v":108.6},{"$error":"#VALUE!"},{"$f":"ROUND(G31*F31,2)","v":{"$error":"#VALUE!"}},null,0]
["2.6",95997,"CONSTRUÇÃO DE PAVIMENTO COM APLICAÇÃO DE CONCRETO BETUMINOSO USINADO A QUENTE (CBUQ), CAMADA DE ROLAMENTO, COM ESPESSURA DE 6,0 CM - EXCLUSIVE TRANSPORTE. AF_03/2017","M3",null,{"$f":"ROUND(F31*0.06,2)","v":6.52},{"$error":"#VALUE!"},{"$f":"ROUND(G32*F32,2)","v":{"$error":"#VALUE!"}},null,0]
["2.7",95875,"TRANSPORTE COM CAMINHÃO BASCULANTE DE 10 M3, EM VIA URBANA PAVIMENTADA","M3XKM",null,{"$f":"(F27+F32)*8","v":410.55999999999995},{"$error":"#VALUE!"},{"$f":"ROUND(G33*F33,2)","v":{"$error":"#VALUE!"}},null,0]
["2.8",72947,"SINALIZACAO HORIZONTAL COM TINTA RETRORREFLETIVA A BASE DE RESINA ACRILICA COM MICROESFERAS DE VIDRO","M2",null,{"$f":"4.8+(1.6*28)+(80*0.2)","v":65.599999999999994},{"$error":"#VALUE!"},{"$f":"ROUND(G34*F34,2)","v":{"$error":"#VALUE!"}},null,0]
[null,null,null,null,null,null,null,null,null,0]
[3,null,"DRENAGEM PLUVIAL","BDI",{"$f":"'P. BDI 3'!F31","v":{"$error":"#VALUE!"}},null,"TOTAL DO GRUPO:",{"$f":"SUM(H37:H45)","v":{"$error":"#VALUE!"}},null,{"$error":"#VALUE!"}]
[null,null,null,null,null,null,null,null,null,0]
["3.1","2 S 04 960 02 DNIT 11/2016","BOCA DE LOBO","UN",null,2,{"$f":"ROUND((E38*$E$36)+E38,2)","v":{"$error":"#VALUE!"}},{"$f":"ROUND(G38*F38,2)","v":{"$error":"#VALUE!"}},null,0]
["3.2",92221,"TUBO DE CONCRETO PARA REDES COLETORAS DE ÁGUAS PLUVIAIS, DIÂMETRO DE 600 MM, JUNTA RÍGIDA, FORNECIMENTO E ASSENTAMENTO.","M",null,12,{"$f":"ROUND((E39*$E$36)+E39,2)","v":{"$error":"#VALUE!"}},{"$f":"ROUND(G39*F39,2)","v":{"$error":"#VALUE!"}},null,0]
["3.3","2 S 04 962 02 DNIT 11/2016","CAIXA DE LIGAÇÃO E PASSAGEM","UN",null,2,{"$error":"#VALUE!"},{"$f":"ROUND(G40*F40,2)","v":{"$error":"#VALUE!"}},null,0]
["3.4",90100,"ESCAVAÇÃO MECANIZADA COM RETROESCAVADEIRA","M3",null,{"$f":"(F39)*0.8*1.4","v":13.440000000000001},{"$error":"#VALUE!"},{"$error":"#VALUE!"},null,0]
["3.5",95875,"TRANSPORTE COM CAMINHÃO BASCULANTE DE 10 M3, EM VIA URBANA PAVIMENTADA","M3XKM",null,{"$f":"(F41*8)","v":107.52000000000001},{"$error":"#VALUE!"},{"$error":"#VALUE!"},null,0]
["3.6",93379,"REATERRO MECANIZADO DE VALA COM RETROESCAVADEIRA, COMPACTADO","M3",null,{"$f":"(F39)*0.8*0.6","v":5.7600000000000007},{"$error":"#VALUE!"},{"$error":"#VALUE!"},null,0]
["3.7",94265,"GUIA (MEIO-FIO) CONCRETO, MOLDADA IN LOCO EM TRECHO RETO COM EXTRUSORA, 14 CM BASE X 30 CM ALTURA. AF_06/2016","M",null,103,{"$error":"#VALUE!"},{"$f":"ROUND(G44*F44,2)","v":{"$error":"#VALUE!"}},null,0]
[null,null,null,null,null,null,null,null,null,0]
[4,null,"MURO / MURETA","BDI",{"$f":"'P. BDI 1'!F31","v":{"$error":"#VALUE!"}},null,"TOTAL DO GRUPO:",{"$f":"SUM(H47:H52)","v":{"$error":"#VALUE!"}},null,{"$error":"#VALUE!"}]
[null,null,null,null,null,null,null,null,null,0]
["4.1",97622,"DEMOLIÇÃO DE ALVENARIA","M3",null,{"$f":"10*0.2","v":2},{"$f":"ROUND((E48*$E$46)+E48,2)","v":{"$error":"#VALUE!"}},{"$f":"ROUND(G48*F48,2)","v":{"$error":"#VALUE!"}},null,0]
["4.2",95956,"EXECUÇÃO DE ESTRUTURAS DE CONCRETO ARMADO,FCK =\n25 MPA. ","M3",null,{"$f":"0.15*0.2*7","v":0.21},{"$f":"ROUND((E49*$E$46)+E49,2)","v":{"$error":"#VALUE!"}},{"$error":"#VALUE!"},null,0]
["4.3",87478,"ALVENARIA DE VEDAÇÃO DE BLOCOS CERÂMICOS FURADOS (ESPESSURA 9CM)  E ARGAMASSA DE ASSENTAMENTO COM PREPARO MANUAL. AF_06/2014","M2",null,6,{"$error":"#VALUE!"},{"$error":"#VALUE!"},null,0]
["4.4",87879,"CHAPISCO APLICADO SOMENTE EM PILARES E VIGAS DAS PAREDES INTERNAS, COM COLHER DE PEDREIRO. ARGAMASSA TRAÇO 1:3 ","M2",null,{"$f":"F50*2","v":12},{"$error":"#VALUE!"},{"$error":"#VALUE!"},null,0]
["4.5",87532,"EMBOÇO, PARA RECEBIMENTO DE CERÂMICA, EM ARGAMASSA TRAÇO 1:2:8, PREPARO MANUAL, APLICADO MANUALMENTE EM FACES , ESPESSURA DE 20MM, COM EXECUÇÃO DE TALISCAS. AF_06/2014","M2",null,{"$f":"F51","v":12},{"$error":"#VALUE!"},{"$error":"#VALUE!"},null,0]
[null,null,null,null,null,null,null,null,null,0]
[5,null,"RAMPAS ACESSIVEIS","BDI",{"$f":"E46","v":{"$error":"#VALUE!"}},null,"TOTAL DO GRUPO:",{"$f":"SUM(H55:H61)","v":{"$error":"#VALUE!"}},null,{"$error":"#VALUE!"}]
[null,null,null,null,null,null,null,null,null,0]
["5.1",96995,"REGULARIZACAO E COMPACTACAO MANUAL DE TERRENO COM SOQUETE","M3",null,{"$f":"F60*0.05","v":0.36000000000000004},{"$f":"ROUND((E56*$E$54)+E56,2)","v":{"$error":"#VALUE!"}},{"$f":"ROUND(G56*F56,2)","v":{"$error":"#VALUE!"}},null,{"$f":"ROUND(F56*E56,2)","v":0}]
["5.2",4721,"LASTRO DE PEDRA BRITADA N. 1 (9,5 a 19 MM)  ESPESSURA 5 CM ","M3",null,{"$f":"F60*0.05","v":0.36000000000000004},{"$f":"ROUND((E57*$E$54)+E57,2)","v":{"$error":"#VALUE!"}},{"$f":"ROUND(G57*F57,2)","v":{"$error":"#VALUE!"}},null,{"$f":"ROUND(F57*E57,2)","v":0}]
["5.3","93679 alt.","EXECUÇÃO DE PAVIMENTO EM PISO INTERTRAVADO, GUIA TATIL OU  ALERTA, COLORIDO, INCL TRAVAMENTO COM AREIA, INCLUSO COLCHAO DE PÓ DE PEDRA 5 CM E COMPACTACAO COM PLACA VIBRATORIA, COM BLOCO DE 20 X 20 CM, ESPESSURA 6 CM.      ","M2",null,{"$f":"0.55*4","v":2.2000000000000002},{"$f":"ROUND((E58*$E$54)+E58,2)","v":{"$error":"#VALUE!"}},{"$f":"ROUND(G58*F58,2)","v":{"$error":"#VALUE!"}},null,{"$f":"ROUND(F58*E58,2)","v":0}]
["5.4",96536,"FORMA TABUA P/ CONCRETO  C/ REAPROVEITAMENTO INCLUSIVE GRAVATEAMENTO","M2",null,{"$f":"0.87*2","v":1.74},{"$f":"ROUND((E59*$E$54)+E59,2)","v":{"$error":"#VALUE!"}},{"$f":"ROUND(G59*F59,2)","v":{"$error":"#VALUE!"}},null,{"$f":"ROUND(F59*E59,2)","v":0}]
["5.5",68325,"PISO EM CONCRETO 20 MPA PREPARO MECANICO, ESPESSURA 7CM, DESEMPENADO","M2",null,{"$f":"1.8*4","v":7.2},{"$f":"ROUND((E60*$E$54)+E60,2)","v":{"$error":"#VALUE!"}},{"$f":"ROUND(G60*F60,2)","v":{"$error":"#VALUE!"}},null,{"$f":"ROUND(F60*E60,2)","v":0}]
[null,null,null,null,null,null,null,null,null,0]
[null,null,"RUA FIRMO HABLICH",null,null,null,"TOTAL:",{"$f":"H64+H78+H89","v":{"$error":"#VALUE!"}},null,0]
[null,null,null,null,null,null,null,null,null,0]
[6,null,"PAVIMENTAÇÃO","BDI",{"$f":"E25","v":{"$error":"#VALUE!"}},null,"TOTAL DO GRUPO:",{"$f":"SUM(H65:H77)","v":{"$error":"#VALUE!"}},null,{"$error":"#VALUE!"}]
[]
["6.1",90100,"ESCAVAÇÃO MECANIZADA COM RETROESCAVADEIRA","M3",{"$f":"E27","v":0},{"$f":"F69+F68","v":52},{"$f":"ROUND((E66*$E$64)+E66,2)","v":{"$error":"#VALUE!"}},{"$f":"ROUND(G66*F66,2)","v":{"$error":"#VALUE!"}},null,{"$f":"ROUND(E66*F66,2)","v":0}]
["6.2",72961,"REGULARIZACAO E COMPACTACAO DE SUBLEITO","M2",{"$f":"E28","v":0},130,{"$f":"ROUND((E67*$E$64)+E67,2)","v":{"$error":"#VALUE!"}},{"$error":"#VALUE!"},null,{"$f":"ROUND(E67*F67,2)","v":0}]
["6.3",96400,"EXECUÇÃO E COMPACTAÇÃO DE BASE E OU SUB BASE COM MACADAME SECO/RACHÃO","M3",{"$f":"E29","v":0},{"$f":"(F67)*0.25","v":32.5},{"$error":"#VALUE!"},{"$error":"#VALUE!"},null,0]
["6.4",96396,"EXECUÇÃO E COMPACTAÇÃO DE BASE E OU SUB BASE COM BRITA GRADUADA SIMPLES","M3",{"$f":"E30","v":0},{"$f":"(F67)*0.15","v":19.5},{"$error":"#VALUE!"},{"$error":"#VALUE!"},null,0]
["6.5",96401,"EXECUÇÃO DE IMPRIMAÇÃO COM ASFALTO DILUÍDO CM-30. AF_09/2017","M2",{"$f":"E31","v":0},{"$f":"F67","v":130},{"$error":"#VALUE!"},{"$error":"#VALUE!"},null,0]
["6.6",73806,"LIMPEZA DE SUPERFICIES COM JATO DE ALTA PRESSAO DE AR E AGUA","M2",null,{"$f":"F72","v":800},{"$error":"#VALUE!"},{"$error":"#VALUE!"},null,0]
["6.7",72942,"PINTURA DE LIGACAO COM EMULSAO RR-1C","M2",null,{"$f":"630+300-F70","v":800},{"$error":"#VALUE!"},{"$error":"#VALUE!"},null,0]
["6.8",96001,"FRESAGEM DE PAVIMENTO ASFÁLTICO (PROFUNDIDADE 5,0 CM)","M2",null,300,{"$error":"#VALUE!"},{"$error":"#VALUE!"},null,0]
["6.9",95997,"CONSTRUÇÃO DE PAVIMENTO COM APLICAÇÃO DE CONCRETO BETUMINOSO USINADO A QUENTE (CBUQ), CAMADA DE ROLAMENTO, COM ESPESSURA DE 6,0 CM","M3",{"$f":"E32","v":0},{"$f":"(F70+F72)*0.06","v":55.8},{"$error":"#VALUE!"},{"$f":"ROUND(G74*F74,2)","v":{"$error":"#VALUE!"}},null,0]
["6.10",95875,"TRANSPORTE COM CAMINHÃO BASCULANTE DE 10 M3, EM VIA URBANA PAVIMENTADA","M3XKM",{"$f":"E33","v":0},{"$f":"(F66+F74)*8","v":862.4},{"$error":"#VALUE!"},{"$f":"ROUND(G75*F75,2)","v":{"$error":"#VALUE!"}},null,0]
["6.11",72947,"SINALIZACAO HORIZONTAL COM TINTA RETRORREFLETIVA A BASE DE RESINA ACRILICA COM MICROESFERAS DE VIDRO","M2",{"$f":"E34","v":0},{"$f":"(1.6*20)+(0.2*50)","v":42},{"$error":"#VALUE!"},{"$error":"#VALUE!"},null,0]
[null,null,null,null,null,null,null,null,null,0]
[7,null,"DRENAGEM PLUVIAL","BDI",{"$f":"E36","v":{"$error":"#VALUE!"}},null,"TOTAL DO GRUPO:",{"$f":"SUM(H79:H87)","v":{"$error":"#VALUE!"}},null,{"$error":"#VALUE!"}]
[null,null,null,null,null,null,null,null,null,0]
["7.1","2 S 04 960 02 DNIT 11/2016","BOCA DE LOBO","UN",null,4,{"$f":"ROUND((E80*$E$78)+E80,2)","v":{"$error":"#VALUE!"}},{"$f":"ROUND(G80*F80,2)","v":{"$error":"#VALUE!"}},null,0]
["7.2",92210,"TUBO DE CONCRETO PARA REDES COLETORAS DE ÁGUAS PLUVIAIS, DIÂMETRO DE 400 MM, JUNTA RÍGIDA. - FORNECIMENTO E ASSENTAMENTO. AF_12/2015","M",null,{"$f":"(15.5+14+16)+7.5","v":53},{"$error":"#VALUE!"},{"$error":"#VALUE!"},null,0]
["7.3",90100,"ESCAVAÇÃO MECANIZADA COM RETROESCAVADEIRA","M3",null,{"$f":"(F81)*0.8*1.4","v":59.360000000000007},{"$error":"#VALUE!"},{"$error":"#VALUE!"},null,0]
["7.4",95875,"TRANSPORTE COM CAMINHÃO BASCULANTE DE 10 M3, EM VIA URBANA PAVIMENTADA","M3XKM",null,{"$f":"(F82*8)-F85","v":466.93000000000006},{"$error":"#VALUE!"},{"$error":"#VALUE!"},null,0]
["7.5",93379,"REATERRO MECANIZADO DE VALA COM RETROESCAVADEIRA, COMPACTADO","M3",null,{"$f":"(F81)*0.8*0.6","v":25.44},{"$error":"#VALUE!"},{"$error":"#VALUE!"},null,0]
["7.6",96396,"EXECUÇÃO E COMPACTAÇÃO DE BASE E OU SUB BASE COM BRITA GRADUADA SIMPLES","M3",{"$f":"E30","v":0},{"$f":"(F86)*0.15","v":7.9499999999999993},{"$error":"#VALUE!"},{"$error":"#VALUE!"},null,0]
["7.7",96401,"EXECUÇÃO DE IMPRIMAÇÃO COM ASFALTO DILUÍDO CM-30. AF_09/2017","M2",{"$f":"E31","v":0},{"$f":"(F81)*1","v":53},{"$error":"#VALUE!"},{"$error":"#VALUE!"},null,0]
["7.8",94265,"GUIA (MEIO-FIO) CONCRETO, MOLDADA IN LOCO EM TRECHO RETO COM EXTRUSORA, 14 CM BASE X 30 CM ALTURA. AF_06/2016","M",{"$f":"E44","v":0},10,{"$error":"#VALUE!"},{"$error":"#VALUE!"},null,0]
[]
[8,null,"RAMPAS ACESSIVEIS","BDI",{"$f":"E54","v":{"$error":"#VALUE!"}},null,"TOTAL DO GRUPO:",{"$f":"SUM(H90:H95)","v":{"$error":"#VALUE!"}},null,{"$f":"ROUND(E89*F89,2)","v":{"$error":"#VALUE!"}}]
[null,null,null,null,null,null,null,null,null,0]
["8.1",96995,"REGULARIZACAO E COMPACTACAO MANUAL DE TERRENO COM SOQUETE","M3",{"$f":"E56","v":0},{"$f":"F95*0.05","v":0.36000000000000004},{"$f":"ROUND((E91*$E$89)+E91,2)","v":{"$error":"#VALUE!"}},{"$f":"ROUND(G91*F91,2)","v":{"$error":"#VALUE!"}},null,{"$f":"ROUND(F91*E91,2)","v":0}]
["8.2",4721,"LASTRO DE PEDRA BRITADA N. 1 (9,5 a 19 MM)  ESPESSURA 5 CM ","M3",{"$f":"E57","v":0},{"$f":"F95*0.05","v":0.36000000000000004},{"$f":"ROUND((E92*$E$89)+E92,2)","v":{"$error":"#VALUE!"}},{"$f":"ROUND(G92*F92,2)","v":{"$error":"#VALUE!"}},null,{"$f":"ROUND(F92*E92,2)","v":0}]
["8.3","93679 alt.","EXECUÇÃO DE PAVIMENTO EM PISO INTERTRAVADO, GUIA TATIL OU  ALERTA, COLORIDO, INCL TRAVAMENTO COM AREIA, INCLUSO COLCHAO DE PÓ DE PEDRA 5 CM E COMPACTACAO COM PLACA VIBRATORIA, COM BLOCO DE 20 X 20 CM, ESPESSURA 6 CM.      ","M2",{"$f":"E58","v":0},{"$f":"0.55*4","v":2.2000000000000002},{"$f":"ROUND((E93*$E$89)+E93,2)","v":{"$error":"#VALUE!"}},{"$f":"ROUND(G93*F93,2)","v":{"$error":"#VALUE!"}},null,{"$f":"ROUND(F93*E93,2)","v":0}]
["8.4",96536,"FORMA TABUA P/ CONCRETO  C/ REAPROVEITAMENTO INCLUSIVE GRAVATEAMENTO","M2",{"$f":"E59","v":0},{"$f":"0.87*2","v":1.74},{"$f":"ROUND((E94*$E$89)+E94,2)","v":{"$error":"#VALUE!"}},{"$f":"ROUND(G94*F94,2)","v":{"$error":"#VALUE!"}},null,{"$f":"ROUND(F94*E94,2)","v":0}]
["8.5",68325,"PISO EM CONCRETO 20 MPA PREPARO MECANICO, ESPESSURA 7CM, DESEMPENADO","M2",{"$f":"E60","v":0},{"$f":"1.8*4","v":7.2},{"$f":"ROUND((E95*$E$89)+E95,2)","v":{"$error":"#VALUE!"}},{"$f":"ROUND(G95*F95,2)","v":{"$error":"#VALUE!"}},null,{"$f":"ROUND(F95*E95,2)","v":0}]
[]
["VALOR TOTAL DA OBRA :",null,null,null,null,null,null,{"$f":"SUM(J19:J96)","v":{"$error":"#VALUE!"}}]
["BDI :",null,null,null,null,null,null,{"$f":"H99-H97","v":{"$error":"#VALUE!"}}]
["VALOR TOTAL DA OBRA COM BDI:",null,null,null,null,null,null,{"$f":"H18+H54+H25+H36+H46+H64+H78+H89","v":{"$error":"#VALUE!"}}]
[]
[]
[]
[]
[]
[]
[]
[]
[null,null,null,"Responsável Técnico:",{"$f":"'P. BDI 1'!C42","v":"."}]
[null,null,null,"Carimbo e Assinatura CREA/CAU:",{"$f":"'P. BDI 1'!C43","v":"."}]
[]
[]
[]
[]
[]
[]
[]
[]
[]
[]
[]
[]
[null,null,null,"Responsavel Legal:",{"$f":"'P. BDI 1'!C51","v":"."}]
[null,null,null,"Carimbo e Assinatura",{"$f":"'P. BDI 1'!C52","v":"Cpf:"}]

{"sheet":"EXCLUIR","index":4,"n_rows":95,"n_cols":8,"rows_kept":95,"cut":false,"hidden":true,"merged":[[11,0,11,1],[68,0,68,6],[69,0,69,6],[70,0,70,6],[6,0,6,1],[7,0,7,1],[8,0,8,1],[8,4,8,7],[9,0,9,1],[10,0,10,1],[1,0,2,7],[4,0,4,1],[4,3,4,4],[4,5,4,6],[5,0,5,1],[5,3,5,4],[5,5,5,6]]}
["IMPRIMIR EM PAPEL TIMBRADO DA EMPRESA PROPONENTE "]
["PLANILHA ORÇAMENTARIA"]
[]
[]
[{"$f":"'P. BDI 1'!B3","v":"Edital :"},null,{"$f":"'P. BDI 1'!C3:F3","v":"TP- 002/2019"},"Área:",null,{"$f":"F43","v":0},null,"m²"]
[{"$f":"'P. BDI 1'!B4","v":"Tomador: "},null,{"$f":"'P. BDI 1'!C4:F4","v":"Prefeitura Municipal de Dois Vizinhos - PR"},"Custo R$/m2",null,{"$f":"H71/F5","v":{"$error":"#DIV/0!"}}]
[{"$f":"'P. BDI 1'!B5","v":"Empreendimento: "},null,{"$f":"'P. BDI 1'!C5:F5","v":"Reforma e revitalização de vias urbanas"}]
[{"$f":"'P. BDI 1'!B6","v":"Local da Obra:"},null,{"$f":"'P. BDI 1'!C6:F6","v":"Dois Vizinhos - Pr"}]
[{"$f":"'P. BDI 1'!B7","v":"Empresa Prop.:"},null,{"$f":"'P. BDI 1'!C7:F7","v":"xxxxxxxxxxxxxx"}]
[{"$f":"'P. BDI 1'!B8","v":"CNPJ:"},null,{"$f":"'P. BDI 1'!C8:F8","v":"xxxxxxxxxxxxxx"}]
[{"$f":"'P. BDI 1'!B9","v":"Referencia:"},null,"SINAPI 05/2018 Desonerado"]
["BDI c/ desoneração:",null,{"$f":"QCI!C15","v":0}]
[]
["ITEM .","REF.","DESCRIÇÃO","UN","VALOR UNIT.","QUANT.","VALOR UNIT C/ BDI","TOTAL"]
[]
[null,null,"RUA PRESIDENTE KENNEDY"]
[".1",null,"SERVIÇOS PRELIMINARES","BDI",{"$f":"E31","v":{"$error":"#VALUE!"}},null,"TOTAL DO GRUPO:",{"$f":"SUM(H18:H30)","v":1085.6400000000001}]
[]
["1.1","74209/001","PLACA DE OBRA (PARA CONSTRUCAO CIVIL) EM CHAPA GALVANIZADA *N. 22*, DE *2,0 X 1,125* M","M2",321.95999999999998,2.25,{"$f":"ROUND((E19*$C$12)+E19,2)","v":321.95999999999998},{"$f":"ROUND(G19*F19,2)","v":724.41}]
[]
[null,"97627","DEMOLIÇÃO DE PILARES (POSTES) EM CONCRETO ARMADO, DE FORMA MECANIZADA COM MARTELETE, SEM REAPROVEITAMENTO. ","M3",209.33,{"$f":"5*0.35*0.35*2.5","v":1.5312499999999998},{"$f":"ROUND((E21*$C$12)+E21,2)","v":209.33},{"$f":"ROUND(G21*F21,2)","v":320.54000000000002}]
[null,"85335 seil","RETIRADA DE MEIO FIO C/ EMPILHAMENTO E S/ REMOCAO","M",7.75,5.25,7.75,40.69]
[null,97636,"DEMOLIÇÃO PARCIAL DE PAVIMENTO ASFÁLTICO, DE FORMA MECANIZADA, SEM REAPROVEITAMENTO. AF_12/2017","M2",9.2200000000000006,null,9.2200000000000006,0]
[]
["1.2",94319,"ATERRO MANUAL COM SOLO, COMPACTADO PARA REGULARIZAÇÃO SUB-LEITO","M3",27.74,{"$f":"ROUND(F43*0.05,2)","v":0},{"$f":"ROUND((E25*$C$12)+E25,2)","v":27.74},{"$f":"ROUND(G25*F25,2)","v":0}]
["1.3",96396,"EXECUÇÃO E COMPACTAÇÃO DE BASE E OU SUB BASE COM BRITA GRADUADA SIMPLES","M3",70.260000000000005,{"$f":"ROUND(F43*0.06,2)","v":0},70.260000000000005,0]
[]
[]
[null,"der 601200","reaterro e apiloamento mecanico","M3",21.38,null,{"$f":"ROUND((E29*$C$12)+E29,2)","v":21.38},{"$f":"ROUND(G29*F29,2)","v":0}]
[null,93377,"REATERRO MECANIZADO DE VALA COM RETROESCAVADEIRA (CAPACIDADE DA CAÇAMBA DA RETRO: 0,26 M³ / POTÊNCIA: 88 HP), LARGURA DE 0,8 A 1,5 M, PROFUNDIDADE DE 1,5 A 3,0 M, COM SOLO (SEM SUBSTITUIÇÃO) DE 1ª CATEGORIA EM LOCAIS COM ALTO NÍVEL DE INTERFERÊNCIA. AF_04/2016","M3",7.25]
[".2",null,"PAVIMENTAÇÃO RUA KENDUY","BDI",{"$f":"'P. BDI 2'!F31","v":{"$error":"#VALUE!"}},null,"TOTAL DO GRUPO:",{"$f":"SUM(H42:H68)","v":0}]
[]
[]
[null,"DER 512050","Demolição Mecânica de Pavimento e Transporte","M3",22.19]
[null,"DER 511100","Regularização compac.subleito 100% PN","M2",2.27]
[null,"DER 531000","Brita Graduada","M3",85.92]
[null,"DER 531350","Macadame Seco c/ Bica Corrida","M3",66.540000000000006]
[null,96401,"EXECUÇÃO DE IMPRIMAÇÃO COM ASFALTO DILUÍDO CM-30. AF_09/2017","M2",4.34]
[null,96001,"FRESAGEM DE PAVIMENTO ASFALTICO PROF. 5CM","M2",4.63]
[]
[]
[null,72942,"PINTURA DE LIGACAO COM EMULSAO RR-1C","M2",1.29]
["2.1",95993,"CONSTRUÇÃO DE PAVIMENTO COM APLICAÇÃO DE CONCRETO BETUMINOSO USINADO A QUENTE (CBUQ), CAMADA DE ROLAMENTO, COM ESPESSURA DE 6,0 CM - EXCLUSIVE TRANSPORTE. AF_03/2017","M3",658.3,null,658.3,0]
[null,72887,"TRANSPORTE COMERCIAL COM CAMINHAO BASCULANTE 6 M3, RODOVIA PAVIMENTADA DMT 35 KM"]
[null,95875,"TRANSPORTE COM CAMINHÃO BASCULANTE DE 10 M3, EM VIA URBANA PAVIMENTADA","M3XKM",1.02]
[null,94265,"GUIA (MEIO-FIO) CONCRETO, MOLDADA IN LOCO EM TRECHO RETO COM EXTRUSORA, 14 CM BASE X 30 CM ALTURA. AF_06/2016","M",26.36]
[null,94263,"GUIA (MEIO-FIO) CONCRETO, MOLDADA IN LOCO REBAIXADO COM EXTRUSORA, 11,5 CM BASE X 22 CM ALTURA. ","M",21.29]
[]
[null,72947,"SINALIZACAO HORIZONTAL COM TINTA RETRORREFLETIVA A BASE DE RESINA ACRILICA COM MICROESFERAS DE VIDRO","M2",26.26]
[]
[".3",null,"DRENAGEM PLUVIAL","BDI",{"$f":"'P. BDI 3'!F31","v":{"$error":"#VALUE!"}},null,"TOTAL DO GRUPO:",{"$f":"SUM(H76:H87)","v":0}]
[]
[null,"2 S 04 960 02 DNIT","*BOCA DE LOBO EM SIMPLES GRELHA","UN",922.52,0,{"$f":"ROUND((E53*$C$12)+E53,2)","v":922.52},{"$f":"ROUND(G53*F53,2)","v":0}]
[null,83659,"BOCA DE LOBO EM ALVENARIA TIJOLO MACICO, REVESTIDA C/ ARGAMASSA DE CIMENTO E AREIA 1:3, SOBRE LASTRO DE CONCRETO 10CM E TAMPA DE CONCRETO ARMADO","UN",720.77,0,720.77,0]
[null,92221,"TUBO DE CONCRETO PARA REDES COLETORAS DE ÁGUAS PLUVIAIS, DIÂMETRO DE 600 MM, JUNTA RÍGIDA, INSTALADO EM LOCAL COM ALTO NÍVEL DE INTERFERÊNCIAS - FORNECIMENTO E ASSENTAMENTO.","M",141.80000000000001]
[null,"2 S 04 962 02 DNIT","CAIXA DE LIGAÇÃO E PASSAGEM - CLP 02","UN",972.93]
[null,93362,"REATERRO MECANIZADO DE VALA COM ESCAVADEIRA HIDRÁULICA (CAPACIDADE DA CAÇAMBA: 0,8 M³ / POTÊNCIA: 111 HP), LARGURA DE 1,5 A 2,5 M, PROFUNDIDADE DE 1,5 A 3,0 M, COM SOLO (SEM SUBSTITUIÇÃO) DE 1ª CATEGORIA EM LOCAIS COM ALTO NÍVEL DE INTERFERÊNCIA. AF_04/2016","M3",8.3000000000000007]
[]
[]
[".4",null,"MURO / MURETA","BDI",{"$f":"'P. BDI 1'!F31","v":{"$error":"#VALUE!"}},null,"TOTAL DO GRUPO:",{"$f":"SUM(H84:H95)","v":0}]
[]
[null,"97622 SINAPI","DEMOLIÇÃO DE ALVENARIA","M3",42.97]
[null,"95955 SINAPI","EXECUÇÃO DE ESTRUTURAS DE CONCRETO ARMADO,FCK =\n25 MPA. ","M3",1889.83]
[null,"87478 SINAPI","ALVENARIA DE VEDAÇÃO DE BLOCOS CERÂMICOS FURADOS DE 9X19X39CM (ESPESSURA 9CM)  E ARGAMASSA DE ASSENTAMENTO COM PREPARO MANUAL. AF_06/2014","M2",32.11]
[null,"87879 SINAPI","CHAPISCO APLICADO SOMENTE EM PILARES E VIGAS DAS PAREDES INTERNAS, COM COLHER DE PEDREIRO. ARGAMASSA TRAÇO 1:3 ","M2",2.94]
[null,"87532 SINAPI","EMBOÇO, PARA RECEBIMENTO DE CERÂMICA, EM ARGAMASSA TRAÇO 1:2:8, PREPARO MANUAL, APLICADO MANUALMENTE EM FACES , ESPESSURA DE 20MM, COM EXECUÇÃO DE TALISCAS. AF_06/2014","M2",26.31]
[]
[]
["VALOR TOTAL DA OBRA :",null,null,null,null,null,null,{"$f":"ROUND(H71/(1+C12),2)","v":1085.6400000000001}]
["BDI :",null,null,null,null,null,null,{"$f":"H71-H69","v":0}]
["VALOR TOTAL DA OBRA COM BDI:",null,null,null,null,null,null,{"$f":"H17+H31","v":1085.6400000000001}]
[]
[]
[]
[]
[]
[]
[]
[]
[]
[]
[]
[]
[]
[]
[null,null,null,"Responsável Técnico:",{"$f":"'P. BDI 1'!C42","v":"."}]
[null,null,null,"Carimbo e Assinatura CREA/CAU:",{"$f":"'P. BDI 1'!C43","v":"."}]
[]
[]
[]
[]
[]
[]
[null,null,null,"Responsavel Legal:"]
[null,null,null,"Carimbo e Assinatura"]

{"sheet":"QCI","index":5,"n_rows":59,"n_cols":8,"rows_kept":59,"cut":false,"hidden":false,"merged":[[12,0,12,1],[13,0,13,1],[14,0,14,1],[24,5,24,6],[24,3,24,4],[9,5,9,6],[9,3,9,4],[11,0,11,1],[9,0,9,1],[10,0,10,1],[1,0,2,7],[7,0,7,1],[7,3,7,4],[7,5,7,6],[8,0,8,1],[8,5,8,6],[8,3,8,4],[32,1,32,6],[33,1,33,6],[31,1,31,6],[28,5,28,6],[29,3,29,4],[28,3,28,4],[30,5,30,6],[30,3,30,4],[29,5,29,6],[27,3,27,4],[27,5,27,6],[25,5,25,6],[25,3,25,4],[26,3,26,4],[26,5,26,6]]}
["IMPRIMIR EM PAPEL TIMBRADO DA EMPRESA PROPONENTE "]
["QUADRO DE COMPOSIÇÃO DE INVESTIMENTO "]
[]
[]
[]
[]
[]
[{"$f":"'P. BDI 1'!B3","v":"Edital :"},null,{"$f":"'P. BDI 1'!C3:F3","v":"TP- 002/2019"},"Area Total (m2):",null,{"$f":"'Kennedy e Hablich'!F70+'Kennedy e Hablich'!F72+'Kennedy e Hablich'!F31","v":1038.5999999999999}]
[{"$f":"'P. BDI 1'!B4","v":"Tomador: "},null,{"$f":"'P. BDI 1'!C4:F4","v":"Prefeitura Municipal de Dois Vizinhos - PR"},"Valor Tot. c/ BDI:",null,{"$f":"H34","v":{"$error":"#VALUE!"}}]
[{"$f":"'P. BDI 1'!B5","v":"Empreendimento: "},null,{"$f":"'P. BDI 1'!C5:F5","v":"Reforma e revitalização de vias urbanas"},"Custo R$/m2",null,{"$f":"F9/F8","v":{"$error":"#VALUE!"}}]
[{"$f":"'P. BDI 1'!B6","v":"Local da Obra:"},null,{"$f":"C26","v":"AVENIDA PRESIDENTE KENNEDY E RUA FIRMO HABLICH"}]
[{"$f":"'P. BDI 1'!B7","v":"Empresa Prop.:"},null,{"$f":"'P. BDI 1'!C7:F7","v":"xxxxxxxxxxxxxx"}]
[{"$f":"'P. BDI 1'!B8","v":"CNPJ:"},null,{"$f":"'P. BDI 1'!C8:F8","v":"xxxxxxxxxxxxxx"}]
[{"$f":"'P. BDI 1'!B9","v":"Referencia:"},null,{"$f":"'P. BDI 1'!C9:F9","v":"xxxxxxxxxxxxxx"}]
[]
[]
[]
[]
[]
[]
[]
[]
[]
[]
[null,"LOTE","DESCRIÇÃO ","% DO GRUPO",null,"VALOR DO GRUPO:",null,"TOTAL ACUM."]
[null,1,"AVENIDA PRESIDENTE KENNEDY E RUA FIRMO HABLICH",{"$f":"F26/$H$34","v":{"$error":"#VALUE!"}},null,{"$f":"'Kennedy e Hablich'!H99","v":{"$error":"#VALUE!"}},null,{"$f":"F26","v":{"$error":"#VALUE!"}}]
[]
[]
[]
[]
[]
[null,"VALOR TOTAL DA OBRA :",null,null,null,null,null,{"$f":"'Kennedy e Hablich'!H97","v":{"$error":"#VALUE!"}}]
[null,"BDI :",null,null,null,null,null,{"$f":"'Kennedy e Hablich'!H98","v":{"$error":"#VALUE!"}}]
[null,"VALOR TOTAL DA OBRA COM BDI:",null,null,null,null,null,{"$f":"SUM(F26:G31)","v":{"$error":"#VALUE!"}}]
[]
[]
[]
[]
[]
[]
[]
[]
[]
[]
[]
[null,null,null,"Responsável Técnico:",{"$f":"'P. BDI 1'!C42","v":"."}]
[null,null,null,"Carimbo e Assinatura CREA/CAU:",{"$f":"'P. BDI 1'!C43","v":"."}]
[]
[]
[]
[]
[]
[]
[]
[]
[]
[]
[null,null,null,"Responsavel Legal:",{"$f":"'P. BDI 1'!C51","v":"."}]
[null,null,null,"Carimbo e assinatura:",{"$f":"'P. BDI 1'!C52","v":"Cpf:"}]

{"sheet":"CRON","index":6,"n_rows":47,"n_cols":11,"rows_kept":47,"cut":false,"hidden":false,"merged":[[21,1,21,3],[21,4,21,5],[1,0,2,10],[10,0,10,1],[11,0,11,1],[7,0,7,1],[5,5,5,6],[9,0,9,1],[4,0,4,1],[4,3,4,4],[4,5,4,6],[5,0,5,1],[5,3,5,4],[6,0,6,1],[6,3,6,4],[6,5,6,6],[8,0,8,1],[14,2,14,3],[14,4,14,5],[16,4,16,5],[15,4,15,5],[15,2,15,3],[18,4,18,5],[19,4,19,5],[20,4,20,5],[17,4,17,5],[16,2,16,3],[18,2,18,3],[19,2,19,3],[20,2,20,3]]}
["IMPRIMIR EM PAPEL TIMBRADO DA EMPRESA PROPONENTE "]
["CRONOGRAMA FÍSICO-FINANCEIRO "]
[]
[]
[{"$f":"'P. BDI 1'!B3","v":"Edital :"},null,{"$f":"'P. BDI 1'!C3:F3","v":"TP- 002/2019"},"Area:",null,{"$f":"QCI!F8","v":1038.5999999999999}]
[{"$f":"'P. BDI 1'!B4","v":"Tomador: "},null,{"$f":"'P. BDI 1'!C4:F4","v":"Prefeitura Municipal de Dois Vizinhos - PR"},"Valor Tot. c/ BDI:",null,{"$f":"K22","v":{"$error":"#VALUE!"}}]
[{"$f":"'P. BDI 1'!B5","v":"Empreendimento: "},null,{"$f":"'P. BDI 1'!C5:F5","v":"Reforma e revitalização de vias urbanas"},"Custo R$/m2",null,{"$f":"F6/F5","v":{"$error":"#VALUE!"}}]
[{"$f":"'P. BDI 1'!B6","v":"Local da Obra:"},null,{"$f":"QCI!C11","v":"AVENIDA PRESIDENTE KENNEDY E RUA FIRMO HABLICH"}]
[{"$f":"'P. BDI 1'!B7","v":"Empresa Prop.:"},null,{"$f":"'P. BDI 1'!C7:F7","v":"xxxxxxxxxxxxxx"}]
[{"$f":"'P. BDI 1'!B8","v":"CNPJ:"},null,{"$f":"'P. BDI 1'!C8:F8","v":"xxxxxxxxxxxxxx"}]
[{"$f":"'P. BDI 1'!B9","v":"Referencia:"},null,{"$f":"'P. BDI 1'!C9:F9","v":"xxxxxxxxxxxxxx"}]
[]
[]
[]
[null,"LOTE","DESCRIÇÃO ",null,"VALOR DO GRUPO",null,"MÊS °1","MÊS °2","MÊS °3","MÊS °4","% TOTAL"]
[null,{"$f":"QCI!B26","v":1},{"$f":"QCI!C26","v":"AVENIDA PRESIDENTE KENNEDY E RUA FIRMO HABLICH"},null,{"$f":"QCI!F26","v":{"$error":"#VALUE!"}},null,0.9,0.1,null,null,{"$f":"SUM(G16:J16)","v":1}]
[]
[]
[]
[]
[]
[null,"TOTAL:",null,null,null,null,{"$f":"G17*E17+G16*E16+G19*E19+G20*E20+G21*E21","v":{"$error":"#VALUE!"}},{"$f":"H17*E17+H16*E16+H19*E19+H20*E20+H21*E21","v":{"$error":"#VALUE!"}},{"$f":"I17*E17+I16*E16+I19*E19+I20*E20+I21*E21","v":{"$error":"#VALUE!"}},{"$f":"E16*J16","v":{"$error":"#VALUE!"}},{"$f":"SUM(G22:J22)","v":{"$error":"#VALUE!"}}]
[]
[]
[]
[]
[]
[]
[]
[]
[]
[]
[null,null,null,null,null,"Responsável Técnico:",{"$f":"'P. BDI 1'!C42","v":"."}]
[null,null,null,null,null,"Carimbo e Assinatura CREA/CAU:",{"$f":"'P. BDI 1'!C43","v":"."}]
[]
[]
[]
[]
[]
[]
[]
[]
[]
[]
[]
[null,null,null,null,null,"Responsavel Legal:",{"$f":"'P. BDI 1'!C51","v":"."}]
[null,null,null,null,null,"Carimbo e Assinatura",{"$f":"'P. BDI 1'!C52","v":"Cpf:"}]

{"sheet":"Comp.","index":7,"n_rows":41,"n_cols":10,"rows_kept":41,"cut":false,"hidden":true,"merged":[[0,0,1,6]]}
["COMPOSIÇÕES"]
[]
[null,"sipapi 05/18 desonerado",null,null,null,null,null,null,"DESC 5,0%"]
[null,null,null,null,null,null,null,null,{"$f":"[3]Orçamento!J18","v":0.98}]
["PISO",".001","PISO EM CONCRETO 25MPA MOLDADO IN LOCO, ESPESSURA 9 CM, COM ARMACAO EM TELA SOLDADA Q-92, BARRA DE TRANF. POLIDO , JUNTA MASTIQUE.","M2","COMSUMO","VALOR UNIT","VALOR TOTAL"]
["INSUMO",21141,"TELA DE ACO SOLDADA NERVURADA CA-60, Q-92, (1,48 KG/M2), DIAMETRO DO FIO = 4,2 MM, ESPACAMENTO DA MALHA = 15 X 15 CM","M2",1.05,7.49,{"$f":"E6*F6","v":7.8645000000000005},null,15.07,{"$f":"ROUND($I$4*I6,2)","v":14.77}]
["INSUMO","3777","LONA PLASTICA PRETA, E= 150 MICRA","M2","1,1280000",1.07,{"$f":"E7*F7","v":1.20696},null,20.77,{"$f":"ROUND($I$4*I7,2)","v":20.350000000000001}]
["COMPOSICAO",88245,"ARMADOR COM ENCARGOS COMPLEMENTARES","H",0.02,20.95,{"$f":"E8*F8","v":0.41899999999999998},null,20.77,{"$f":"ROUND($I$4*I8,2)","v":20.350000000000001}]
["COMPOSICAO",88309,"PEDREIRO COM ENCARGOS COMPLEMENTARES","H",0.13880000000000001,21.07,2.9245160000000001,null,20.89,{"$f":"ROUND($I$4*I9,2)","v":20.47}]
["COMPOSICAO",88316,"SERVENTE COM ENCARGOS COMPLEMENTARES","H",0.31929999999999997,16.48,5.2620639999999996,null,16.3,15.97]
["INSUMO",38405,"CONCRETO USINADO BOMBEAVEL, CLASSE DE RESISTENCIA C25, COM BRITA 0 E 1, SLUMP =100 +/- 20 MM, INCLUI SERVICO DE BOMBEAMENTO (NBR 8953)","M3",0.09,274.10000000000002,24.669,null,285.02,279.32]
["COMPOSICAO",95278,"DESEMPENADEIRA DE CONCRETO, PESO DE 75KG, 4 PÁS, MOTOR A GASOLINA, POTÊNCIA 5,5 HP - DEPRECIAÇÃO. AF_09/2016","H",0.2,0.54,0.10800000000000001,null,0.54,0.53]
["COMPOSICAO",88309,"PEDREIRO COM ENCARGOS COMPLEMENTARES","H",0.13880000000000001,21.07,{"$f":"E13*F13","v":2.9245160000000001},null,20.89,{"$f":"ROUND($I$4*I13,2)","v":20.47}]
["COMPOSICAO","74121/001","JUNTA DE DILATACAO PARA IMPERMEABILIZACAO, COM SELANTE ELASTICO MONOCOMPONENTE A BASE DE POLIURETANO, MASTIQUE ELASTICO","M",0.69740000000000002,19.07,{"$f":"E14*F14","v":13.299418000000001},null,0.54,{"$f":"ROUND($I$4*I14,2)","v":0.53}]
["COMPOSICAO",97114,"EXECUÇÃO DE JUNTAS DE CONTRAÇÃO PARA PAVIMENTOS DE CONCRETO.","M",0.69740000000000002,0.34,0.23711600000000002,null,20.89,20.47]
[null,null,null,null,null,"TOTAL",{"$f":"SUM(G6:G15)","v":58.915089999999999}]
[]
[]
[]
[]
[]
[]
[]
[]
[]
[]
["URBA",".004","LASTRO DE BRITA ESPESSURA 6CM, INCLUSIVE ESPALHAMENTO DA BRITA E TRANSPORTE DMT 10 KM","M2","COMSUMO","VALOR UNIT","VALOR TOTAL"]
["COMPOSICAO",88316,"SERVENTE COM ENCARGOS COMPLEMENTARES","H",2.5000000000000001E-2,{"$f":"J28","v":15.97},{"$f":"E28*F28","v":0.39925000000000005},null,16.3,{"$f":"ROUND($I$4*I28,2)","v":15.97}]
["COMPOSICAO",4721,"PEDRA BRITADA N. 1 (9,5 a 19 MM) POSTO PEDREIRA/FORNECEDOR, SEM FRETE","M3",0.06,{"$f":"J29","v":37},{"$f":"E29*F29","v":2.2199999999999998},null,37.75,{"$f":"ROUND($I$4*I29,2)","v":37}]
["COMPOSICAO",72887,"TRANSPORTE COMERCIAL COM CAMINHAO BASCULANTE 6 M3, RODOVIA PAVIMENTADA DMT 10KM","M3XKM",{"$f":"E29*10","v":0.6},{"$f":"J30","v":0.99},{"$f":"E30*F30","v":0.59399999999999997},null,1.01,{"$f":"ROUND($I$4*I30,2)","v":0.99}]
[]
[null,null,null,null,null,null,{"$f":"G28+G29+G30+G31","v":3.2132499999999995}]
[]
[]
[]
["PISO","72183","PISO EM CONCRETO 20MPA PREPARO MECANICO, ESPESSURA 7 CM, COM ARMACAO EM TELA SOLDADA","M2",""]
["INSUMO","7156","TELA DE ACO SOLDADA NERVURADA, CA-60, Q-196, (3,11 KG/M2), DIAMETRO DO FIO = 5,0 MM, LARGURA =  2,45 M, ESPACAMENTO DA MALHA = 10 X 10 CM","M2","1,0500000"]
["COMPOSICAO","88245","ARMADOR COM ENCARGOS COMPLEMENTARES","H","0,0200000"]
["COMPOSICAO","88309","PEDREIRO COM ENCARGOS COMPLEMENTARES","H","0,2600000"]
["COMPOSICAO","88316","SERVENTE COM ENCARGOS COMPLEMENTARES","H","1,9400000"]
["COMPOSICAO","94970","CONCRETO FCK = 20MPA, TRAÇO 1:2,7:3 (CIMENTO/ AREIA MÉDIA/ BRITA 1)  - PREPARO MECÂNICO COM BETONEIRA 600 L. AF_07/2016","M3","0,0700000"]

{"sheet":"composicao","index":8,"n_rows":11,"n_cols":9,"rows_kept":11,"cut":false,"hidden":true,"merged":[]}
[]
[]
[]
[]
[null,null,null,"SINAPI 06/2018"]
[]
[null,null,"SERP","97639","REMOÇÃO DE POSTES PEQUENOS DE ILUMINAÇÃO, DE CONCRETO.","UN","FATOR","R$ ","VALOR"]
[null,null,"COMPOSICAO","5680","RETROESCAVADEIRA SOBRE RODAS COM CARREGADEIRA, TRAÇÃO 4X2, POTÊNCIA LÍQ. 79 HP, CAÇAMBA CARREG. CAP. MÍN. 1 M3, CAÇAMBA RETRO CAP. 0,20 M3, PESO OPERACIONAL MÍN. 6.570 KG, PROFUNDIDADE ESCAVAÇÃO MÁX. 4,37 M - CHP DIURNO. AF_06/2014","CHP",0.75,85.73,{"$f":"G8*H8","v":64.297499999999999}]
[null,null,"COMPOSICAO","88316","SERVENTE COM ENCARGOS COMPLEMENTARES","H","0,5586000",16.45,{"$f":"G9*H9","v":9.1889699999999994}]
[null,null,"COMPOSICAO","88264","ELETRICISTA COM ENCARGOS COMPLEMENTARES","H",0.25,21.24,{"$f":"G10*H10","v":5.31}]
[null,null,null,null,null,null,null,"total",{"$f":"SUM(I8:I10)","v":78.796469999999999}]

{"sheet":"CRONO MORADIAS 08-08-07","index":9,"n_rows":36,"n_cols":16,"rows_kept":36,"cut":false,"hidden":true,"merged":[]}
[null,"CRONOGRAMA FÍSICO-FINANCEIRO"]
[null,{"$f":"#REF!","v":{"$error":"#REF!"}},null,"ÁREA TOTAL 1008,00 m2"]
[null,"Cliente: SECRETARIA DE AÇÃO SOCIAL"]
[null,"DOIS VIZINHOS -PR"]
[]
[null,"Serviços","Total do Ítem",null,"1º Mes",null,"2º Mes",null,"3º Mes",null,"4º Mes",null,"5º Mes",null,"6º Mes"]
[null,null,"R($)","(%)","R($)","(%)","R($)","(%)","R($)","(%)","R($)","(%)","R($)","(%)","R($)","(%)"]
[1,{"$f":"#REF!","v":{"$error":"#REF!"}},{"$f":"'Kennedy e Hablich'!#REF!","v":{"$error":"#REF!"}},{"$f":"C8/$C$19","v":{"$error":"#REF!"}},{"$f":"C8/3","v":{"$error":"#REF!"}},{"$f":"E8/C19","v":{"$error":"#REF!"}},{"$f":"E8","v":{"$error":"#REF!"}},{"$f":"G8/$C$19","v":{"$error":"#REF!"}},{"$f":"G8","v":{"$error":"#REF!"}},{"$f":"I8/$C$19","v":{"$error":"#REF!"}}]
[2,{"$f":"#REF!","v":{"$error":"#REF!"}},{"$f":"'Kennedy e Hablich'!#REF!","v":{"$error":"#REF!"}},{"$error":"#REF!"},{"$f":"C9/6","v":{"$error":"#REF!"}},{"$f":"E9/$C$19","v":{"$error":"#REF!"}},{"$f":"E9","v":{"$error":"#REF!"}},{"$f":"G9/$C$19","v":{"$error":"#REF!"}},{"$f":"E9","v":{"$error":"#REF!"}},{"$f":"I9/$C$19","v":{"$error":"#REF!"}},{"$f":"I9","v":{"$error":"#REF!"}},{"$error":"#REF!"},{"$error":"#REF!"},{"$error":"#REF!"},{"$error":"#REF!"},{"$error":"#REF!"}]
[3,{"$f":"#REF!","v":{"$error":"#REF!"}},{"$f":"'Kennedy e Hablich'!#REF!","v":{"$error":"#REF!"}},{"$error":"#REF!"},{"$f":"C10/12","v":{"$error":"#REF!"}},{"$f":"E10/$C$19","v":{"$error":"#REF!"}},{"$f":"E10","v":{"$error":"#REF!"}},{"$f":"G10/$C$19","v":{"$error":"#REF!"}},{"$f":"E10","v":{"$error":"#REF!"}},{"$f":"I10/$C$19","v":{"$error":"#REF!"}},{"$f":"I10","v":{"$error":"#REF!"}},{"$f":"K10/$C$19","v":{"$error":"#REF!"}},{"$f":"K10","v":{"$error":"#REF!"}},{"$f":"M10/$C$19","v":{"$error":"#REF!"}},{"$f":"M10","v":{"$error":"#REF!"}},{"$f":"O10/$C$19","v":{"$error":"#REF!"}}]
[4,{"$f":"#REF!","v":{"$error":"#REF!"}},{"$f":"'Kennedy e Hablich'!#REF!","v":{"$error":"#REF!"}},{"$error":"#REF!"}]
[5,{"$f":"#REF!","v":{"$error":"#REF!"}},{"$f":"'Kennedy e Hablich'!#REF!","v":{"$error":"#REF!"}},{"$error":"#REF!"}]
[6,{"$f":"#REF!","v":{"$error":"#REF!"}},{"$f":"'Kennedy e Hablich'!#REF!","v":{"$error":"#REF!"}},{"$error":"#REF!"},{"$f":"C13/12","v":{"$error":"#REF!"}},{"$f":"E13/$C$19","v":{"$error":"#REF!"}},{"$f":"E13","v":{"$error":"#REF!"}},{"$f":"G13/$C$19","v":{"$error":"#REF!"}},{"$f":"E13","v":{"$error":"#REF!"}},{"$f":"I13/$C$19","v":{"$error":"#REF!"}},{"$f":"I13","v":{"$error":"#REF!"}},{"$f":"K13/$C$19","v":{"$error":"#REF!"}},{"$f":"K13","v":{"$error":"#REF!"}},{"$f":"M13/$C$19","v":{"$error":"#REF!"}},{"$f":"M13","v":{"$error":"#REF!"}},{"$f":"O13/$C$19","v":{"$error":"#REF!"}}]
[7,{"$f":"#REF!","v":{"$error":"#REF!"}},{"$f":"'Kennedy e Hablich'!#REF!","v":{"$error":"#REF!"}},{"$error":"#REF!"},{"$f":"C14/12","v":{"$error":"#REF!"}},{"$f":"E14/$C$19","v":{"$error":"#REF!"}},{"$f":"E14","v":{"$error":"#REF!"}},{"$f":"G14/$C$19","v":{"$error":"#REF!"}},{"$f":"E14","v":{"$error":"#REF!"}},{"$f":"I14/$C$19","v":{"$error":"#REF!"}},{"$f":"I14","v":{"$error":"#REF!"}},{"$f":"K14/$C$19","v":{"$error":"#REF!"}},{"$f":"K14","v":{"$error":"#REF!"}},{"$f":"M14/$C$19","v":{"$error":"#REF!"}},{"$f":"M14","v":{"$error":"#REF!"}},{"$f":"O14/$C$19","v":{"$error":"#REF!"}}]
[8,{"$f":"#REF!","v":{"$error":"#REF!"}},{"$f":"'Kennedy e Hablich'!#REF!","v":{"$error":"#REF!"}},{"$error":"#REF!"},null,null,null,null,null,null,{"$f":"C15/9","v":{"$error":"#REF!"}},{"$f":"K15/$C$19","v":{"$error":"#REF!"}},{"$f":"K15","v":{"$error":"#REF!"}},{"$f":"M15/$C$19","v":{"$error":"#REF!"}},{"$f":"K15","v":{"$error":"#REF!"}},{"$f":"O15/$C$19","v":{"$error":"#REF!"}}]
[9,{"$f":"#REF!","v":{"$error":"#REF!"}},{"$f":"'Kennedy e Hablich'!#REF!","v":{"$error":"#REF!"}},{"$error":"#REF!"}]
[10,{"$f":"#REF!","v":{"$error":"#REF!"}},{"$f":"'Kennedy e Hablich'!#REF!","v":{"$error":"#REF!"}},{"$error":"#REF!"}]
[11,{"$f":"#REF!","v":{"$error":"#REF!"}},{"$f":"'Kennedy e Hablich'!#REF!","v":{"$error":"#REF!"}},{"$error":"#REF!"}]
[null,"Totais R($)",{"$f":"SUM(C8:C18)","v":{"$error":"#REF!"}},{"$error":"#REF!"},{"$error":"#REF!"},{"$error":"#REF!"},{"$error":"#REF!"},{"$error":"#REF!"},{"$error":"#REF!"},{"$error":"#REF!"},{"$error":"#REF!"},{"$error":"#REF!"},{"$error":"#REF!"},{"$error":"#REF!"},{"$error":"#REF!"},{"$error":"#REF!"}]
[null,"Totais Acumulados R($)",null,null,{"$f":"E19","v":{"$error":"#REF!"}},{"$f":"F19","v":{"$error":"#REF!"}},{"$f":"G19+E20","v":{"$error":"#REF!"}},{"$error":"#REF!"},{"$error":"#REF!"},{"$error":"#REF!"},{"$error":"#REF!"},{"$error":"#REF!"},{"$error":"#REF!"},{"$f":"L20+N19","v":{"$error":"#REF!"}},{"$f":"M20+O19","v":{"$error":"#REF!"}},{"$f":"N20+P19","v":{"$error":"#REF!"}}]
[]
[" ","Serviços","Total do Ítem",null,"7º Mes",null,"8º Mes",null,"9º Mes",null,"10º Mes",null,"11º Mes",null,"12º Mes"]
[null,null,"R($)","(%)","R($)","(%)","R($)","(%)","R($)","(%)","R($)","(%)","R($)","(%)","R($)","(%)"]
[1,{"$f":"B8","v":{"$error":"#REF!"}},{"$f":"C8","v":{"$error":"#REF!"}},{"$f":"C24/$C$19","v":{"$error":"#REF!"}}]
[2,{"$f":"B9","v":{"$error":"#REF!"}},{"$error":"#REF!"},{"$error":"#REF!"}]
[3,{"$error":"#REF!"},{"$error":"#REF!"},{"$error":"#REF!"},{"$f":"E10","v":{"$error":"#REF!"}},{"$f":"E26/$C$19","v":{"$error":"#REF!"}},{"$f":"E26","v":{"$error":"#REF!"}},{"$f":"G26/$C$19","v":{"$error":"#REF!"}},{"$f":"G26","v":{"$error":"#REF!"}},{"$f":"I26/$C$19","v":{"$error":"#REF!"}},{"$f":"E26","v":{"$error":"#REF!"}},{"$f":"K26/$C$19","v":{"$error":"#REF!"}},{"$f":"G26","v":{"$error":"#REF!"}},{"$error":"#REF!"},{"$f":"I26","v":{"$error":"#REF!"}},{"$f":"O26/$C$19","v":{"$error":"#REF!"}}]
[4,{"$error":"#REF!"},{"$error":"#REF!"},{"$error":"#REF!"},{"$f":"C27/6","v":{"$error":"#REF!"}},{"$f":"E27/$C$19","v":{"$error":"#REF!"}},{"$f":"E27","v":{"$error":"#REF!"}},{"$f":"G27/$C$19","v":{"$error":"#REF!"}},{"$f":"E27","v":{"$error":"#REF!"}},{"$f":"I27/$C$19","v":{"$error":"#REF!"}},{"$f":"I27","v":{"$error":"#REF!"}},{"$error":"#REF!"},{"$f":"K27","v":{"$error":"#REF!"}},{"$error":"#REF!"},{"$f":"M27","v":{"$error":"#REF!"}},{"$error":"#REF!"}]
[5,{"$error":"#REF!"},{"$error":"#REF!"},{"$error":"#REF!"},{"$f":"C28/6","v":{"$error":"#REF!"}},{"$f":"E28/$C$19","v":{"$error":"#REF!"}},{"$f":"E28","v":{"$error":"#REF!"}},{"$f":"G28/$C$19","v":{"$error":"#REF!"}},{"$f":"E28","v":{"$error":"#REF!"}},{"$f":"I28/$C$19","v":{"$error":"#REF!"}},{"$f":"I28","v":{"$error":"#REF!"}},{"$error":"#REF!"},{"$f":"K28","v":{"$error":"#REF!"}},{"$error":"#REF!"},{"$f":"M28","v":{"$error":"#REF!"}},{"$error":"#REF!"}]
[6,{"$error":"#REF!"},{"$error":"#REF!"},{"$error":"#REF!"},{"$f":"E13","v":{"$error":"#REF!"}},{"$f":"E29/$C$19","v":{"$error":"#REF!"}},{"$f":"E13","v":{"$error":"#REF!"}},{"$f":"G29/$C$19","v":{"$error":"#REF!"}},{"$f":"E29","v":{"$error":"#REF!"}},{"$f":"I29/$C$19","v":{"$error":"#REF!"}},{"$f":"E29","v":{"$error":"#REF!"}},{"$error":"#REF!"},{"$f":"G29","v":{"$error":"#REF!"}},{"$error":"#REF!"},{"$f":"I29","v":{"$error":"#REF!"}},{"$error":"#REF!"}]
[7,{"$error":"#REF!"},{"$error":"#REF!"},{"$error":"#REF!"},{"$f":"E14","v":{"$error":"#REF!"}},{"$f":"E30/$C$19","v":{"$error":"#REF!"}},{"$f":"E14","v":{"$error":"#REF!"}},{"$f":"G30/$C$19","v":{"$error":"#REF!"}},{"$f":"E30","v":{"$error":"#REF!"}},{"$f":"I30/$C$19","v":{"$error":"#REF!"}},{"$f":"I30","v":{"$error":"#REF!"}},{"$error":"#REF!"},{"$f":"K30","v":{"$error":"#REF!"}},{"$error":"#REF!"},{"$f":"M30","v":{"$error":"#REF!"}},{"$error":"#REF!"}]
[8,{"$error":"#REF!"},{"$error":"#REF!"},{"$error":"#REF!"},{"$f":"K15","v":{"$error":"#REF!"}},{"$f":"E31/C19","v":{"$error":"#REF!"}},{"$f":"E31","v":{"$error":"#REF!"}},{"$f":"F31","v":{"$error":"#REF!"}},{"$f":"G31","v":{"$error":"#REF!"}},{"$f":"H31","v":{"$error":"#REF!"}},{"$f":"G31","v":{"$error":"#REF!"}},{"$error":"#REF!"},{"$f":"I31","v":{"$error":"#REF!"}},{"$error":"#REF!"},{"$f":"K31","v":{"$error":"#REF!"}},{"$error":"#REF!"}]
[9,{"$error":"#REF!"},{"$error":"#REF!"},{"$error":"#REF!"},null,null,null,null,null,null,{"$f":"C32/3","v":{"$error":"#REF!"}},{"$error":"#REF!"},{"$f":"K32","v":{"$error":"#REF!"}},{"$error":"#REF!"},{"$f":"K32","v":{"$error":"#REF!"}},{"$error":"#REF!"}]
[10,{"$error":"#REF!"},{"$error":"#REF!"},{"$error":"#REF!"},null,null,null,null,null,null,{"$f":"C33/3","v":{"$error":"#REF!"}},{"$error":"#REF!"},{"$f":"K33","v":{"$error":"#REF!"}},{"$error":"#REF!"},{"$f":"K33","v":{"$error":"#REF!"}},{"$error":"#REF!"}]
[11,{"$error":"#REF!"},{"$error":"#REF!"},{"$error":"#REF!"},null,null,null,null,null,null,{"$f":"C34/3","v":{"$error":"#REF!"}},{"$error":"#REF!"},{"$f":"K34","v":{"$error":"#REF!"}},{"$error":"#REF!"},{"$f":"K34","v":{"$error":"#REF!"}},{"$error":"#REF!"}]
[null,"Totais R($)",{"$f":"SUM(C24:C34)","v":{"$error":"#REF!"}},{"$error":"#REF!"},{"$error":"#REF!"},{"$error":"#REF!"},{"$error":"#REF!"},{"$error":"#REF!"},{"$error":"#REF!"},{"$error":"#REF!"},{"$error":"#REF!"},{"$error":"#REF!"},{"$error":"#REF!"},{"$error":"#REF!"},{"$error":"#REF!"},{"$error":"#REF!"}]
[null,"Totais Acumulados R($)",null,null,{"$f":"E35+O20","v":{"$error":"#REF!"}},{"$f":"F35+P20","v":{"$error":"#REF!"}},{"$f":"E36+G35","v":{"$error":"#REF!"}},{"$error":"#REF!"},{"$error":"#REF!"},{"$error":"#REF!"},{"$error":"#REF!"},{"$error":"#REF!"},{"$error":"#REF!"},{"$error":"#REF!"},{"$error":"#REF!"},{"$error":"#REF!"}]