{"text_format":"1","workbook":"xlsx","n_sheets":4,"sheets":["P. BDI","QCI","CRON","Orçamento"],"not_rendered":{"charts":0,"images":0,"macros":1,"external_links":1,"defined_names":26,"comments":1,"pivot_tables":0},"unopened":[],"bounds":{"document_bytes":16777216,"sheet_cells":100000,"rows_first":2000,"rows_last":500,"rows_between":2000,"halvings":0,"cell_chars":16384,"cell_head_chars":4096},"cells_cut":0,"cells_raw":0,"read":"whole","date_system":"1900"}

{"sheet":"P. BDI","index":0,"n_rows":53,"n_cols":10,"rows_kept":53,"cut":false,"hidden":false,"merged":[[34,1,34,5],[35,1,35,5],[14,3,14,5],[18,2,18,4],[25,1,25,4],[26,1,26,4],[27,1,27,4],[29,1,29,4],[11,3,11,5],[6,2,6,5],[7,2,7,5],[30,1,30,4],[32,1,32,5],[8,2,8,5],[1,1,1,5],[2,2,2,5],[3,2,3,5],[4,2,4,5],[5,2,5,5]]}
[null,"IMPRIMIR EM PAPEL TIMBRADO DA EMPRESA PROPONENTE "]
[null,"BDI - Bonificações e Despesas Indiretas"]
[null,"Edital :","TP - 20/2019"]
[null,"Tomador: ","Prefeitura Municipal de Dois Vizinhos - PR"]
[null,"Empreendimento: ","Reforma Cobertura Pavilhão 1 Parque de exposições"]
[null,"Local da Obra:","Dois Vizinhos PR"]
[null,"Empresa Prop.:","PREENCHER"]
[null,"CNPJ:","PREENCHER"]
[null,"Data base:","XX/XX/2019"]
[]
[null,"Identifique o tipo de obra:",1,{"$f":"IF(C11>0,IF(C11<7,,\"<--- Insira valor entre 1 e 6\"),\"<--- Insira valor entre 1 e 6\")","v":0}]
[null,"Construção de edifícios:",1,"Informe a base de cálculo do ISSQN."]
[null,"Construção de rodovias e ferrovias:",2,{"$f":"IF(D14<>0,0,\"( X )\")","v":0},"Sobre os serviços."]
[null,"Construção de redes de abastecimento de água, coleta de esgoto e construções correlatas:",3,"x","Sobre a mão-de-obra."]
[null,"Construção e manutenção de estações e redes de distribuição de energia elétrica:",4,"Informe a ocorrência da DESONERAÇÃO da folha de pagamento. Lei 12844/2013."]
[null,"Obras portuárias, marítimas e fluviais:",5,{"$f":"IF(D17<>0,0,\"( X )\")","v":0},"SEM Desoneração."]
[null,"Fornecimento de materiais e equipamentos:",6,"x","COM Desoneração."]
[]
[null,null,"Intervalo de admissibilidade",null,null,null,null,"Ac",{"$f":"F21","v":"preencher"}]
[null,"Item Componente do BDI","1º Quartil","Médio","3º Quartil","Valores Propostos",null,"S",{"$f":"F22","v":"preencher"}]
[null,"Administração Central",0.03,0.04,5.5E-2,"preencher",{"$f":"IF(F21=0,\"\",IF(F21<C21,\"Atenção, observar os intervalos!\",IF(F21>E21,\"Atenção, observar os intervalos!\",\"\")))","v":"Atenção, observar os intervalos!"},"G",{"$f":"I20","v":"preencher"}]
[null,"Seguro e Garantia",8.0000000000000002E-3,8.0000000000000002E-3,0.01,"preencher",{"$f":"IF(F22=0,\"\",IF(F22<C22,\"Atenção, observar os intervalos!\",IF(F22>E22,\"Atenção, observar os intervalos!\",\"\")))","v":"Atenção, observar os intervalos!"},"R",{"$f":"F23","v":"preencher"}]
[null,"Risco",9.7000000000000003E-3,1.2699999999999999E-2,1.2699999999999999E-2,"preencher",{"$f":"IF(F23=0,\"\",IF(F23<C23,\"Atenção, observar os intervalos!\",IF(F23>E23,\"Atenção, observar os intervalos!\",\"\")))","v":"Atenção, observar os intervalos!"},"DF","preencher"]
[null,"Despesas Financeiras",5.8999999999999999E-3,1.23E-2,1.3899999999999999E-2,"preencher",{"$f":"IF(F24=0,\"\",IF(F24<C24,\"Atenção, observar os intervalos!\",IF(F24>E24,\"Atenção, observar os intervalos!\",\"\")))","v":"Atenção, observar os intervalos!"},"L","preencher"]
[null,"Lucro",6.1600000000000002E-2,7.3999999999999996E-2,8.9599999999999999E-2,"preencher",{"$f":"IF(F25=0,\"\",IF(F25<C25,\"Atenção, observar os intervalos!\",IF(F25>E25,\"Atenção, observar os intervalos!\",\"\")))","v":"Atenção, observar os intervalos!"},"l1","preencher"]
[null,"I1: PIS e COFINS",null,null,null,"preencher",null,"l2","preencher"]
[null,"I2: ISSQN (conforme legislação municipal)",null,null,null,"preencher",null,"l3",4.4999999999999998E-2]
[null,"I3: Cont.Prev s/Rec.Bruta (Lei 12844/13 - Desoneração)",null,null,null,4.4999999999999998E-2]
[]
[null,"BDI - SEM Desoneração da folha de pagamento",null,null,null,{"$f":"ROUND((((1+I19+I21+I22)*(1+I23)*(1+I24))/(1-I25-I26))-1,4)","v":{"$error":"#VALUE!"}},null,"1º QUARTIL","MÉDIO","3º QUARTIL"]
[null,"BDI - COM Desoneração da folha de pagamento",null,null,null,{"$f":"ROUND((((1+I19+I21+I22)*(1+I23)*(1+I24))/(1-I25-I26-I27))-1,4)","v":{"$error":"#VALUE!"}},null,0.2034,0.22120000000000001,0.25]
[]
[null,"Declaramos que esta planilha foi elaborada conforme equação para cálculo do percentual do BDI recomendada pelo Acórdão 2622/2013 - TCU, representada pela fórmula abaixo."]
[]
[null,"BDI - SEM Desoneração = [(1+AC+S+G+R)X(1+DF)X(1+L)/(1-I1-I2)]-1"]
[null,"BDI - COM Desoneração = [(1+AC+S+G+R)X(1+DF)X(1+L)/(1-I1-I2-I3)]-1"]
[]
[]
[]
[]
[]
[]
[null,"Responsável Técnico:","."]
[null,"Carimbo e Assinatura CREA/CAU:","."]
[]
[]
[]
[]
[]
[]
[]
[null,"Responsavel Legal:","."]
[null,"Carimbo e Assinatura","."]

{"sheet":"QCI","index":1,"n_rows":56,"n_cols":8,"rows_kept":56,"cut":false,"hidden":false,"merged":[[27,3,27,4],[27,5,27,6],[32,1,32,6],[33,1,33,6],[34,1,34,6],[28,3,28,4],[28,5,28,6],[30,3,30,4],[29,3,29,4],[31,5,31,6],[31,3,31,4],[30,5,30,6],[29,5,29,6],[1,0,2,7],[7,0,7,1],[7,3,7,4],[7,5,7,6],[8,0,8,1],[8,5,8,6],[8,3,8,4],[9,5,9,6],[9,3,9,4],[11,0,11,1],[9,0,9,1],[10,0,10,1],[12,0,12,1],[13,0,13,1],[14,0,14,1],[24,5,24,6],[26,3,26,4],[26,5,26,6],[24,3,24,4],[25,5,25,6],[25,3,25,4]]}
["IMPRIMIR EM PAPEL TIMBRADO DA EMPRESA PROPONENTE "]
["QUADRO DE COMPOSIÇÃO DE INVESTIMENTO "]
[]
[]
[]
[]
[]
[{"$f":"'P. BDI'!B3","v":"Edital :"},null,{"$f":"'P. BDI'!C3:F3","v":"TP - 20/2019"},"Area de telhado:",null,{"$f":"Orçamento!F5","v":1972},null,"m²"]
[{"$f":"'P. BDI'!B4","v":"Tomador: "},null,{"$f":"'P. BDI'!C4:F4","v":"Prefeitura Municipal de Dois Vizinhos - PR"},"Valor Tot. c/ BDI:",null,{"$f":"Orçamento!H35","v":{"$error":"#VALUE!"}}]
[{"$f":"'P. BDI'!B5","v":"Empreendimento: "},null,{"$f":"'P. BDI'!C5:F5","v":"Reforma Cobertura Pavilhão 1 Parque de exposições"},"Custo R$/m2",null,{"$f":"F9/F8","v":{"$error":"#VALUE!"}}]
[{"$f":"'P. BDI'!B6","v":"Local da Obra:"},null,{"$f":"'P. BDI'!C6:F6","v":"Dois Vizinhos PR"}]
[{"$f":"'P. BDI'!B7","v":"Empresa Prop.:"},null,{"$f":"'P. BDI'!C7:F7","v":"PREENCHER"}]
[{"$f":"'P. BDI'!B8","v":"CNPJ:"},null,{"$f":"'P. BDI'!C8:F8","v":"PREENCHER"}]
[{"$f":"'P. BDI'!B9","v":"Data base:"},null,{"$f":"'P. BDI'!C9:F9","v":"XX/XX/2019"}]
["BDI :",null,{"$f":"Orçamento!C12","v":{"$error":"#VALUE!"}}]
[]
[]
[]
[]
[]
[]
[]
[]
[]
[null,"ITEM .","DESCRIÇÃO ","% DO GRUPO",null,"VALOR DO GRUPO:",null,"TOTAL ACUM."]
[null,1,{"$f":"Orçamento!C16","v":"REFORMA DO PAVILHÃO "},{"$f":"F26/$H$35","v":{"$error":"#VALUE!"}},null,{"$f":"Orçamento!H35","v":{"$error":"#VALUE!"}},null,{"$f":"F26+H28","v":{"$error":"#VALUE!"}}]
[]
[]
[]
[]
[]
[]
[null,null,null,null,null,null,null,{"$f":"Orçamento!H33","v":{"$error":"#VALUE!"}}]
[null,null,null,null,null,null,null,{"$f":"Orçamento!H34","v":{"$error":"#VALUE!"}}]
[null,null,null,null,null,null,null,{"$f":"H33+H34","v":{"$error":"#VALUE!"}}]
[]
[]
[]
[]
[]
[]
[]
[null,null,null,"Responsável Técnico:",{"$f":"'P. BDI'!C43","v":"."}]
[null,null,null,"Carimbo e Assinatura CREA/CAU:",{"$f":"'P. BDI'!C44","v":"."}]
[]
[]
[]
[]
[]
[]
[]
[]
[]
[]
[null,null,null,"Responsavel Legal:",{"$f":"'P. BDI'!C52","v":"."}]
[null,null,null,"Carimbo e Assinatura",{"$f":"'P. BDI'!C53","v":"."}]

{"sheet":"CRON","index":2,"n_rows":52,"n_cols":10,"rows_kept":52,"cut":false,"hidden":false,"merged":[[17,2,17,3],[15,2,15,3],[19,2,19,3],[20,2,20,3],[21,2,21,3],[17,4,17,5],[15,4,15,5],[19,4,19,5],[20,4,20,5],[21,4,21,5],[18,4,18,5],[8,0,8,1],[14,2,14,3],[14,4,14,5],[16,4,16,5],[16,2,16,3],[22,1,22,3],[22,4,22,5],[1,0,2,9],[10,0,10,1],[11,0,11,1],[7,0,7,1],[5,5,5,6],[9,0,9,1],[4,0,4,1],[4,3,4,4],[4,5,4,6],[5,0,5,1],[5,3,5,4],[6,0,6,1],[6,3,6,4],[6,5,6,6]]}
["IMPRIMIR EM PAPEL TIMBRADO DA EMPRESA PROPONENTE "]
["CRONOGRAMA FÍSICO-FINANCEIRO "]
[]
[]
[{"$f":"'P. BDI'!B3","v":"Edital :"},null,{"$f":"'P. BDI'!C3:F3","v":"TP - 20/2019"},"Area da Ampliação:",null,{"$f":"Orçamento!F5","v":1972}]
[{"$f":"'P. BDI'!B4","v":"Tomador: "},null,{"$f":"'P. BDI'!C4:F4","v":"Prefeitura Municipal de Dois Vizinhos - PR"},"Valor Tot. c/ BDI:",null,{"$f":"Orçamento!H35","v":{"$error":"#VALUE!"}}]
[{"$f":"'P. BDI'!B5","v":"Empreendimento: "},null,{"$f":"'P. BDI'!C5:F5","v":"Reforma Cobertura Pavilhão 1 Parque de exposições"},"Custo R$/m2",null,{"$f":"F6/F5","v":{"$error":"#VALUE!"}}]
[{"$f":"'P. BDI'!B6","v":"Local da Obra:"},null,{"$f":"'P. BDI'!C6:F6","v":"Dois Vizinhos PR"}]
[{"$f":"'P. BDI'!B7","v":"Empresa Prop.:"},null,{"$f":"'P. BDI'!C7:F7","v":"PREENCHER"}]
[{"$f":"'P. BDI'!B8","v":"CNPJ:"},null,{"$f":"'P. BDI'!C8:F8","v":"PREENCHER"}]
[{"$f":"'P. BDI'!B9","v":"Data base:"},null,{"$f":"'P. BDI'!C9:F9","v":"XX/XX/2019"}]
["BDI.:",null,{"$f":"Orçamento!C12","v":{"$error":"#VALUE!"}}]
[]
[]
[null,"ITEM","DESCRIÇÃO ",null,"VALOR DO GRUPO",null,"MÊS °1","MÊS °2","MÊS °3","% TOTAL"]
[null,{"$f":"QCI!B26","v":1},{"$f":"QCI!C26","v":"REFORMA DO PAVILHÃO "},null,{"$f":"QCI!F26","v":{"$error":"#VALUE!"}},null,0.3,0.6,0.1,{"$f":"SUM(G16:I16)","v":0.99999999999999989}]
[]
[]
[]
[]
[]
[]
[null,"TOTAL:",null,null,null,null,{"$f":"G17*E17+G18*E18+G16*E16+G20*E20+G21*E21+G22*E22","v":{"$error":"#VALUE!"}},{"$f":"+H17*E17+H18*E18+H16*E16+H20*E20+H21*E21+H22*E22","v":{"$error":"#VALUE!"}},{"$f":"I17*E17+I18*E18+I16*E16+I20*E20+I21*E21+I22*E22","v":{"$error":"#VALUE!"}},{"$f":"SUM(G23:I23)","v":{"$error":"#VALUE!"}}]
[]
[]
[]
[]
[]
[]
[]
[]
[]
[]
[]
[null,null,null,null,null,"Responsável Técnico:",{"$f":"'P. BDI'!C43","v":"."}]
[null,null,null,null,null,"Carimbo e Assinatura CREA/CAU:",{"$f":"'P. BDI'!C44","v":"."}]
[]
[]
[]
[]
[]
[]
[]
[]
[]
[]
[]
[]
[]
[]
[null,null,null,null,null,"Responsavel Legal:",{"$f":"'P. BDI'!C52","v":"."}]
[null,null,null,null,null,"Carimbo e Assinatura",{"$f":"'P. BDI'!C53","v":"."}]

{"sheet":"Orçamento","index":3,"n_rows":62,"n_cols":11,"rows_kept":62,"cut":false,"hidden":false,"merged":[[33,0,33,6],[8,4,8,7],[34,0,34,6],[9,0,9,1],[10,0,10,1],[8,0,8,1],[32,0,32,6],[11,0,11,1],[9,3,9,4],[1,0,2,7],[4,0,4,1],[5,0,5,1],[6,0,6,1],[7,0,7,1],[4,3,4,4],[5,3,5,4],[4,5,4,6],[5,5,5,6]]}
["IMPRIMIR EM PAPEL TIMBRADO DA EMPRESA PROPONENTE "]
["PLANILHA ORÇAMENTARIA"]
[]
[]
[{"$f":"'P. BDI'!B3","v":"Edital :"},null,{"$f":"'P. BDI'!C3:F3","v":"TP - 20/2019"},"Área de telhado:",null,{"$f":"F20","v":1972},null,"m²"]
[{"$f":"'P. BDI'!B4","v":"Tomador: "},null,{"$f":"'P. BDI'!C4:F4","v":"Prefeitura Municipal de Dois Vizinhos - PR"},"Custo R$/m2",null,{"$f":"H35/F5","v":{"$error":"#VALUE!"}}]
[{"$f":"'P. BDI'!B5","v":"Empreendimento: "},null,{"$f":"'P. BDI'!C5:F5","v":"Reforma Cobertura Pavilhão 1 Parque de exposições"}]
[{"$f":"'P. BDI'!B6","v":"Local da Obra:"},null,{"$f":"'P. BDI'!C6:F6","v":"Dois Vizinhos PR"}]
[{"$f":"'P. BDI'!B7","v":"Empresa Prop.:"},null,{"$f":"'P. BDI'!C7:F7","v":"PREENCHER"}]
[{"$f":"'P. BDI'!B8","v":"CNPJ:"},null,{"$f":"'P. BDI'!C8:F8","v":"PREENCHER"},"Área da edificação: ",null,{"$f":"63.5*24.5","v":1555.75},"m²"]
[{"$f":"'P. BDI'!B9","v":"Data base:"},null,{"$f":"'P. BDI'!C9:F9","v":"XX/XX/2019"}]
["BDI:",null,{"$f":"'P. BDI'!F31","v":{"$error":"#VALUE!"}}]
[]
["ITEM .","REF.","DESCRIÇÃO","UN","VALOR UNIT.","QUANT.","VALOR UNIT C/ BDI","TOTAL"]
[]
[null,null,"REFORMA DO PAVILHÃO ",null,null,null,null,null,null,null,{"$f":"E16*F16","v":0}]
[]
["1.1","5928 alt.","SERVIÇO DE MUNK / CESTO AEREO","CHP",null,{"$f":"30*8","v":240},{"$f":"ROUND((E18*$C$12)+E18,2)","v":{"$error":"#VALUE!"}},{"$f":"ROUND(G18*F18,2)","v":{"$error":"#VALUE!"}}]
["1.2","COMP. 01","REMOÇÃO DA MANTA ASFALTICA ANTIGA","M2",null,{"$f":"(29*65.5)-(5.3*14*2)+(17*6.5*2)-0.1","v":1972},{"$f":"ROUND((E19*$C$12)+E19,2)","v":{"$error":"#VALUE!"}},{"$f":"ROUND(G19*F19,2)","v":{"$error":"#VALUE!"}}]
["1.3","97649","REMOÇÃO DE TELHAS  METÁLICA, DE FORMA MECANIZADA, COM USO DE GUINDASTE","M2",null,{"$f":"(29*65.5)-(5.3*14*2)+(17*6.5*2)-0.1","v":1972},{"$error":"#VALUE!"},{"$error":"#VALUE!"}]
["1.4","73806/1","LIMPEZA/LAVAGEM DA ESTRUTURA","M2",null,{"$f":"F26","v":810.52},{"$error":"#VALUE!"},{"$error":"#VALUE!"}]
["1.5","COMP. 02","REMOÇÃO DE TERÇAS METÁLICA PARA COBERTURA, DE FORMA MANUAL","M",null,{"$f":"63.5*6","v":381},{"$error":"#VALUE!"},{"$error":"#VALUE!"}]
["1.6","COMP. 03","FORNEC. E INSTALAÇÃO DE TERÇAS NOVAS PERFIL \"U\" SIMPLES 100x40 MM E=2,65MM","M",null,{"$f":"F22","v":381},{"$error":"#VALUE!"},{"$error":"#VALUE!"}]
["1.7","COMP. 04","REPARO DA PONTA DOS ARCOS","UD",null,4,{"$error":"#VALUE!"},{"$error":"#VALUE!"}]
["1.8","COMP. 05","REPARO DA PORTA METALICA","UD",null,2,{"$error":"#VALUE!"},{"$error":"#VALUE!"}]
["1.9","79498/1 alt.","PINTURA COM LIXAMENTO DA ESTRUTURA , A OLEO (ESMALTE SINTETICO)  SOBRE SUPERFICIE METALICA, UMA DEMAO INCLUSO UMA DEMAO DE FUNDO CONVERTEDOR ANTICORROSIVO","M2",null,{"$f":"(0.18*2*65*20)+((28*0.4*13)+(0.3*5*6))*1.8+((4.2*4.1)+(4.2*2.5)+(2*2.2))*2","v":810.52},{"$f":"ROUND((E26*$C$12)+E26,2)","v":{"$error":"#VALUE!"}},{"$f":"ROUND(G26*F26,2)","v":{"$error":"#VALUE!"}}]
["1.10","COMP. 06","TELHAMENTO TELHA ONDULADA OND-17 GALVALUME E=0,50MM  NATURAL, RECOBR. DUPLO, INCLUSO IÇAMENTO E FIXADORES - PARAFUSOS","M2",null,{"$f":"F20","v":1972},{"$error":"#VALUE!"},{"$error":"#VALUE!"}]
["1.11",94449,"TELHAMENTO COM TELHA ONDULADA DE FIBRA DE VIDRO E = 0,6 MM, INCLUSO IÇAMENTO","M2",null,{"$f":"16*4*0.6","v":38.4},{"$error":"#VALUE!"},{"$error":"#VALUE!"}]
["1.12","94231","RUFO EM CHAPA DE AÇO GALVANIZADO NÚMERO 24, CORTE DE 25 CM, INCLUSO TRANSPORTE VERTICAL. AF_06/2016","M",null,{"$f":"35+13+15*4","v":108},{"$error":"#VALUE!"},{"$error":"#VALUE!"}]
[]
[]
[]
["VALOR TOTAL DA OBRA :",null,null,null,null,null,null,{"$f":"ROUND(H35/(1+C12),2)","v":{"$error":"#VALUE!"}}]
["BDI :",null,null,null,null,null,null,{"$f":"H35-H33","v":{"$error":"#VALUE!"}}]
["VALOR TOTAL DA OBRA COM BDI:",null,null,null,null,null,null,{"$f":"SUM(H18:H29)","v":{"$error":"#VALUE!"}}]
[]
[]
[]
[]
[]
[]
[]
[]
[]
[]
[null,null,null,"Responsável Técnico:",{"$f":"'P. BDI'!C43","v":"."}]
[null,null,null,"Carimbo e Assinatura CREA/CAU:",{"$f":"'P. BDI'!C44","v":"."}]
[]
[]
[]
[]
[]
[]
[]
[]
[]
[]
[]
[]
[]
[null,null,null,"Responsavel Legal:",{"$f":"'P. BDI'!C52","v":"."}]
[null,null,null,"Carimbo e Assinatura",{"$f":"'P. BDI'!C53","v":"."}]